{"text_format":"1","workbook":"xlsx","n_sheets":19,"sheets":["Page 1","Page 2","Page 3","Page 4","Page 5","Page 6","Page 7","Page 8","Page 9","Page 10","Page 11","Page 12","Page 13","Page 14","Page 15","Test","Paste","Reference","Summary"],"not_rendered":{"charts":0,"images":0,"macros":1,"external_links":0,"defined_names":15,"comments":0,"pivot_tables":0},"unopened":[],"bounds":{"document_bytes":16777216,"sheet_cells":100000,"rows_first":2000,"rows_last":500,"rows_between":2000,"halvings":0,"cell_chars":16384,"cell_head_chars":4096},"cells_cut":0,"cells_raw":0,"read":"whole","date_system":"1900"}

{"sheet":"Page 1","index":0,"n_rows":35,"n_cols":5,"rows_kept":35,"cut":false,"hidden":false,"merged":[[7,9,7,13],[1,1,1,6],[2,1,2,6]]}
[]
[null,"Abstract Assessment Roll"]
[null,"_______________________ County, Wyoming Tax Year 2024"]
[]
[]
[null,"Line","Classification","Market or Productive Value","Assessed Value"]
[null,"A","Agriculture Lands",{"$f":"'Page 3'!F40","v":0},{"$f":"'Page 3'!G40","v":0}]
[null,"B","Residential and Commercial Real Property",{"$f":"'Page 4'!D45","v":0},{"$f":"'Page 4'!E45","v":0}]
[null,"C","Residential and Commercial Personal Property",{"$f":"'Page 4'!D58","v":0},{"$f":"'Page 4'!E58","v":0}]
[null,"D","Industrial Real and Personal Property",{"$f":"'Page 9'!H30","v":0},{"$f":"'Page 9'!I30","v":0}]
[null,"E","Total, County Assessed Property",{"$f":"SUM(D7:D10)","v":0},{"$f":"SUM(E7:E10)","v":0}]
[]
[]
[]
[null,"STATE OF WYOMING"]
[null,null,null,")"]
[null,null,null,")    ss."]
[null,"County of __________________",null,")"]
[]
[]
[null,"I, ___________________________, County Assessor in and for said County, in Wyoming, do hereby "]
[]
[null,"certify that the within and foregoing abstract of the assessment roll of the County of ______________________ "]
[]
[null,"for the year 2024, was compiled from the official returns made by me for said year, after the same had been "]
[]
[null,"corrected and equalized by the Board of County Commissioners sitting as a Board of Equalization in and for "]
[]
[null,"said County, and the said abstract embraces the entire amount of locally assessed taxable property of said "]
[]
[null,"County as shown by said Assessment Roll."]
[]
[null,"IN TESTIMONY WHEREOF, I have hereunto set my hand this ____ day of _______________, 2024"]
[]
[null,"_____________________________________________________________________County Assessor"]

{"sheet":"Page 2","index":1,"n_rows":30,"n_cols":6,"rows_kept":30,"cut":false,"hidden":false,"merged":[[10,0,11,0],[10,1,11,1],[10,2,11,2],[10,5,11,5],[10,4,11,4],[10,3,11,3]]}
["Agricultural- Irrigated Crop Lands"]
["Line","Classification","Acres","Productivity Value Per Acre","Productive Value","Assessed Value"]
[null,"LRA 1-2-3        (DOR code)"]
[1,"Class II               40101",{"$f":"IF(ISERROR(VLOOKUP(RIGHT(B4,5),Reference!$A$2:$F$201,5,FALSE))=TRUE,0,VLOOKUP(RIGHT(B4,5),Reference!$A$2:$F$201,5,FALSE))","v":0},{"$f":"IF(C4>0,E4/C4,0)","v":0},{"$f":"VALUE(VLOOKUP(RIGHT(B4,5),Reference!$A$2:$H$201,4,FALSE))","v":0},{"$f":"VALUE(VLOOKUP(RIGHT(B4,5),Reference!$A$2:$H$201,3,FALSE))","v":0}]
[2,"Class III              40102",{"$f":"IF(ISERROR(VLOOKUP(RIGHT(B5,5),Reference!$A$2:$F$201,5,FALSE))=TRUE,0,VLOOKUP(RIGHT(B5,5),Reference!$A$2:$F$201,5,FALSE))","v":0},{"$f":"IF(C5>0,E5/C5,0)","v":0},{"$f":"VALUE(VLOOKUP(RIGHT(B5,5),Reference!$A$2:$H$201,4,FALSE))","v":0},{"$f":"VALUE(VLOOKUP(RIGHT(B5,5),Reference!$A$2:$H$201,3,FALSE))","v":0}]
[3,"Class IV             40103",{"$f":"IF(ISERROR(VLOOKUP(RIGHT(B6,5),Reference!$A$2:$F$201,5,FALSE))=TRUE,0,VLOOKUP(RIGHT(B6,5),Reference!$A$2:$F$201,5,FALSE))","v":0},{"$f":"IF(C6>0,E6/C6,0)","v":0},{"$f":"VALUE(VLOOKUP(RIGHT(B6,5),Reference!$A$2:$H$201,4,FALSE))","v":0},{"$f":"VALUE(VLOOKUP(RIGHT(B6,5),Reference!$A$2:$H$201,3,FALSE))","v":0}]
[4,"Class V-VIII        40104",{"$f":"IF(ISERROR(VLOOKUP(RIGHT(B7,5),Reference!$A$2:$F$201,5,FALSE))=TRUE,0,VLOOKUP(RIGHT(B7,5),Reference!$A$2:$F$201,5,FALSE))","v":0},{"$f":"IF(C7>0,E7/C7,0)","v":0},{"$f":"VALUE(VLOOKUP(RIGHT(B7,5),Reference!$A$2:$H$201,4,FALSE))","v":0},{"$f":"VALUE(VLOOKUP(RIGHT(B7,5),Reference!$A$2:$H$201,3,FALSE))","v":0}]
[null,"LRA 4-5        (DOR code)"]
[5,"Class III              40105",{"$f":"IF(ISERROR(VLOOKUP(RIGHT(B9,5),Reference!$A$2:$F$201,5,FALSE))=TRUE,0,VLOOKUP(RIGHT(B9,5),Reference!$A$2:$F$201,5,FALSE))","v":0},{"$f":"IF(C9>0,E9/C9,0)","v":0},{"$f":"VALUE(VLOOKUP(RIGHT(B9,5),Reference!$A$2:$H$201,4,FALSE))","v":0},{"$f":"VALUE(VLOOKUP(RIGHT(B9,5),Reference!$A$2:$H$201,3,FALSE))","v":0}]
[6,"Class IV             40106",{"$f":"IF(ISERROR(VLOOKUP(RIGHT(B10,5),Reference!$A$2:$F$201,5,FALSE))=TRUE,0,VLOOKUP(RIGHT(B10,5),Reference!$A$2:$F$201,5,FALSE))","v":0},{"$f":"IF(C10>0,E10/C10,0)","v":0},{"$f":"VALUE(VLOOKUP(RIGHT(B10,5),Reference!$A$2:$H$201,4,FALSE))","v":0},{"$f":"VALUE(VLOOKUP(RIGHT(B10,5),Reference!$A$2:$H$201,3,FALSE))","v":0}]
[7,"Class V-VIII        40107",{"$f":"IF(ISERROR(VLOOKUP(RIGHT(B11,5),Reference!$A$2:$F$201,5,FALSE))=TRUE,0,VLOOKUP(RIGHT(B11,5),Reference!$A$2:$F$201,5,FALSE))","v":0},{"$f":"IF(C11>0,E11/C11,0)","v":0},{"$f":"VALUE(VLOOKUP(RIGHT(B11,5),Reference!$A$2:$H$201,4,FALSE))","v":0},{"$f":"VALUE(VLOOKUP(RIGHT(B11,5),Reference!$A$2:$H$201,3,FALSE))","v":0}]
[null,null,null,{"$f":"IF(C12>0,E12/C12,0)","v":0}]
[100,"Total Agricultural Irrigated Crop Lands",{"$f":"SUM(C3:C12)","v":0},null,{"$f":"E4+E5+E6+E7+E9+E10+E11","v":0},{"$f":"F4+F5+F6+F7+F9+F10+F11","v":0}]
[]
[]
["Agricultural- Dry Crop Lands"]
["Line","Classification","Acres","Productivity Value Per Acre","Productive Value","Assessed Value"]
[null,"LRA 1-2-3        (DOR code)"]
[101,"Class III              40201",{"$f":"IF(ISERROR(VLOOKUP(RIGHT(B19,5),Reference!$A$2:$F$201,5,FALSE))=TRUE,0,VLOOKUP(RIGHT(B19,5),Reference!$A$2:$F$201,5,FALSE))","v":0},{"$f":"IF(C19>0,E19/C19,0)","v":0},{"$f":"VALUE(VLOOKUP(RIGHT(B19,5),Reference!$A$2:$H$201,4,FALSE))","v":0},{"$f":"VALUE(VLOOKUP(RIGHT(B19,5),Reference!$A$2:$H$201,3,FALSE))","v":0}]
[102,"Class IV              40202",{"$f":"IF(ISERROR(VLOOKUP(RIGHT(B20,5),Reference!$A$2:$F$201,5,FALSE))=TRUE,0,VLOOKUP(RIGHT(B20,5),Reference!$A$2:$F$201,5,FALSE))","v":0},{"$f":"IF(C20>0,E20/C20,0)","v":0},{"$f":"VALUE(VLOOKUP(RIGHT(B20,5),Reference!$A$2:$H$201,4,FALSE))","v":0},{"$f":"VALUE(VLOOKUP(RIGHT(B20,5),Reference!$A$2:$H$201,3,FALSE))","v":0}]
[103,"Class V-VIII         40203",{"$f":"IF(ISERROR(VLOOKUP(RIGHT(B21,5),Reference!$A$2:$F$201,5,FALSE))=TRUE,0,VLOOKUP(RIGHT(B21,5),Reference!$A$2:$F$201,5,FALSE))","v":0},{"$f":"IF(C21>0,E21/C21,0)","v":0},{"$f":"VALUE(VLOOKUP(RIGHT(B21,5),Reference!$A$2:$H$201,4,FALSE))","v":0},{"$f":"VALUE(VLOOKUP(RIGHT(B21,5),Reference!$A$2:$H$201,3,FALSE))","v":0}]
[null,"LRA 4             (DOR code)"]
[104,"Class III              40204",{"$f":"IF(ISERROR(VLOOKUP(RIGHT(B23,5),Reference!$A$2:$F$201,5,FALSE))=TRUE,0,VLOOKUP(RIGHT(B23,5),Reference!$A$2:$F$201,5,FALSE))","v":0},{"$f":"IF(C23>0,E23/C23,0)","v":0},{"$f":"VALUE(VLOOKUP(RIGHT(B23,5),Reference!$A$2:$H$201,4,FALSE))","v":0},{"$f":"VALUE(VLOOKUP(RIGHT(B23,5),Reference!$A$2:$H$201,3,FALSE))","v":0}]
[105,"Class IV             40205",{"$f":"IF(ISERROR(VLOOKUP(RIGHT(B24,5),Reference!$A$2:$F$201,5,FALSE))=TRUE,0,VLOOKUP(RIGHT(B24,5),Reference!$A$2:$F$201,5,FALSE))","v":0},{"$f":"IF(C24>0,E24/C24,0)","v":0},{"$f":"VALUE(VLOOKUP(RIGHT(B24,5),Reference!$A$2:$H$201,4,FALSE))","v":0},{"$f":"VALUE(VLOOKUP(RIGHT(B24,5),Reference!$A$2:$H$201,3,FALSE))","v":0}]
[106,"Class V-VIII        40206",{"$f":"IF(ISERROR(VLOOKUP(RIGHT(B25,5),Reference!$A$2:$F$201,5,FALSE))=TRUE,0,VLOOKUP(RIGHT(B25,5),Reference!$A$2:$F$201,5,FALSE))","v":0},{"$f":"IF(C25>0,E25/C25,0)","v":0},{"$f":"VALUE(VLOOKUP(RIGHT(B25,5),Reference!$A$2:$H$201,4,FALSE))","v":0},{"$f":"VALUE(VLOOKUP(RIGHT(B25,5),Reference!$A$2:$H$201,3,FALSE))","v":0}]
[null,"LRA 5             (DOR code)"]
[107,"Class III              40207",{"$f":"IF(ISERROR(VLOOKUP(RIGHT(B27,5),Reference!$A$2:$F$201,5,FALSE))=TRUE,0,VLOOKUP(RIGHT(B27,5),Reference!$A$2:$F$201,5,FALSE))","v":0},{"$f":"IF(C27>0,E27/C27,0)","v":0},{"$f":"VALUE(VLOOKUP(RIGHT(B27,5),Reference!$A$2:$H$201,4,FALSE))","v":0},{"$f":"VALUE(VLOOKUP(RIGHT(B27,5),Reference!$A$2:$H$201,3,FALSE))","v":0}]
[108,"Class IV             40208",{"$f":"IF(ISERROR(VLOOKUP(RIGHT(B28,5),Reference!$A$2:$F$201,5,FALSE))=TRUE,0,VLOOKUP(RIGHT(B28,5),Reference!$A$2:$F$201,5,FALSE))","v":0},{"$f":"IF(C28>0,E28/C28,0)","v":0},{"$f":"VALUE(VLOOKUP(RIGHT(B28,5),Reference!$A$2:$H$201,4,FALSE))","v":0},{"$f":"VALUE(VLOOKUP(RIGHT(B28,5),Reference!$A$2:$H$201,3,FALSE))","v":0}]
[109,"Class V-VIII        40209",{"$f":"IF(ISERROR(VLOOKUP(RIGHT(B29,5),Reference!$A$2:$F$201,5,FALSE))=TRUE,0,VLOOKUP(RIGHT(B29,5),Reference!$A$2:$F$201,5,FALSE))","v":0},{"$f":"IF(C29>0,E29/C29,0)","v":0},{"$f":"VALUE(VLOOKUP(RIGHT(B29,5),Reference!$A$2:$H$201,4,FALSE))","v":0},{"$f":"VALUE(VLOOKUP(RIGHT(B29,5),Reference!$A$2:$H$201,3,FALSE))","v":0}]
[200,"Total Agricultural Dry Crop Lands",{"$f":"SUM(C18:C29)","v":0},null,{"$f":"SUM(E19:E29)","v":0},{"$f":"SUM(F19:F29)","v":0}]

{"sheet":"Page 3","index":2,"n_rows":40,"n_cols":7,"rows_kept":40,"cut":false,"hidden":false,"merged":[]}
["Agricultural- Range Lands"]
["Land",null,"Classification","Acres","Productivity Value Per Acre","Productive Value","Assessed Value"]
[null,null,"LRA 1            (DOR Code)"]
[201,null,"R-1                    40301",{"$f":"IF(ISERROR(VLOOKUP(RIGHT(C4,5),Reference!$A$2:$F$201,5,FALSE))=TRUE,0,VLOOKUP(RIGHT(C4,5),Reference!$A$2:$F$201,5,FALSE))","v":0},{"$f":"IF(D4>0,F4/D4,0)","v":0},{"$f":"VALUE(VLOOKUP(RIGHT(C4,5),Reference!$A$2:$H$201,4,FALSE))","v":0},{"$f":"VALUE(VLOOKUP(RIGHT(C4,5),Reference!$A$2:$H$201,3,FALSE))","v":0}]
[202,null,"R-2                    40302",{"$f":"IF(ISERROR(VLOOKUP(RIGHT(C5,5),Reference!$A$2:$F$201,5,FALSE))=TRUE,0,VLOOKUP(RIGHT(C5,5),Reference!$A$2:$F$201,5,FALSE))","v":0},0,{"$f":"VALUE(VLOOKUP(RIGHT(C5,5),Reference!$A$2:$H$201,4,FALSE))","v":0},{"$f":"VALUE(VLOOKUP(RIGHT(C5,5),Reference!$A$2:$H$201,3,FALSE))","v":0}]
[203,null,"R-3                    40303",{"$f":"IF(ISERROR(VLOOKUP(RIGHT(C6,5),Reference!$A$2:$F$201,5,FALSE))=TRUE,0,VLOOKUP(RIGHT(C6,5),Reference!$A$2:$F$201,5,FALSE))","v":0},0,{"$f":"VALUE(VLOOKUP(RIGHT(C6,5),Reference!$A$2:$H$201,4,FALSE))","v":0},{"$f":"VALUE(VLOOKUP(RIGHT(C6,5),Reference!$A$2:$H$201,3,FALSE))","v":0}]
[204,null,"R-4                    40304",{"$f":"IF(ISERROR(VLOOKUP(RIGHT(C7,5),Reference!$A$2:$F$201,5,FALSE))=TRUE,0,VLOOKUP(RIGHT(C7,5),Reference!$A$2:$F$201,5,FALSE))","v":0},0,{"$f":"VALUE(VLOOKUP(RIGHT(C7,5),Reference!$A$2:$H$201,4,FALSE))","v":0},{"$f":"VALUE(VLOOKUP(RIGHT(C7,5),Reference!$A$2:$H$201,3,FALSE))","v":0}]
[205,null,"R-5                    40305",{"$f":"IF(ISERROR(VLOOKUP(RIGHT(C8,5),Reference!$A$2:$F$201,5,FALSE))=TRUE,0,VLOOKUP(RIGHT(C8,5),Reference!$A$2:$F$201,5,FALSE))","v":0},0,{"$f":"VALUE(VLOOKUP(RIGHT(C8,5),Reference!$A$2:$H$201,4,FALSE))","v":0},{"$f":"VALUE(VLOOKUP(RIGHT(C8,5),Reference!$A$2:$H$201,3,FALSE))","v":0}]
[206,null,"Waste               40306",{"$f":"IF(ISERROR(VLOOKUP(RIGHT(C9,5),Reference!$A$2:$F$201,5,FALSE))=TRUE,0,VLOOKUP(RIGHT(C9,5),Reference!$A$2:$F$201,5,FALSE))","v":0},0,{"$f":"VALUE(VLOOKUP(RIGHT(C9,5),Reference!$A$2:$H$201,4,FALSE))","v":0},{"$f":"VALUE(VLOOKUP(RIGHT(C9,5),Reference!$A$2:$H$201,3,FALSE))","v":0}]
[null,null,"LRA 2            (DOR Code)"]
[207,null,"R-1                    40307",{"$f":"IF(ISERROR(VLOOKUP(RIGHT(C11,5),Reference!$A$2:$F$201,5,FALSE))=TRUE,0,VLOOKUP(RIGHT(C11,5),Reference!$A$2:$F$201,5,FALSE))","v":0},{"$f":"IF(D11>0,F11/D11,0)","v":0},{"$f":"VALUE(VLOOKUP(RIGHT(C11,5),Reference!$A$2:$H$201,4,FALSE))","v":0},{"$f":"VALUE(VLOOKUP(RIGHT(C11,5),Reference!$A$2:$H$201,3,FALSE))","v":0}]
[208,null,"R-2                    40308",{"$f":"IF(ISERROR(VLOOKUP(RIGHT(C12,5),Reference!$A$2:$F$201,5,FALSE))=TRUE,0,VLOOKUP(RIGHT(C12,5),Reference!$A$2:$F$201,5,FALSE))","v":0},0,{"$f":"VALUE(VLOOKUP(RIGHT(C12,5),Reference!$A$2:$H$201,4,FALSE))","v":0},{"$f":"VALUE(VLOOKUP(RIGHT(C12,5),Reference!$A$2:$H$201,3,FALSE))","v":0}]
[209,null,"R-3                    40309",{"$f":"IF(ISERROR(VLOOKUP(RIGHT(C13,5),Reference!$A$2:$F$201,5,FALSE))=TRUE,0,VLOOKUP(RIGHT(C13,5),Reference!$A$2:$F$201,5,FALSE))","v":0},0,{"$f":"VALUE(VLOOKUP(RIGHT(C13,5),Reference!$A$2:$H$201,4,FALSE))","v":0},{"$f":"VALUE(VLOOKUP(RIGHT(C13,5),Reference!$A$2:$H$201,3,FALSE))","v":0}]
[210,null,"R-4                    40310",{"$f":"IF(ISERROR(VLOOKUP(RIGHT(C14,5),Reference!$A$2:$F$201,5,FALSE))=TRUE,0,VLOOKUP(RIGHT(C14,5),Reference!$A$2:$F$201,5,FALSE))","v":0},0,{"$f":"VALUE(VLOOKUP(RIGHT(C14,5),Reference!$A$2:$H$201,4,FALSE))","v":0},{"$f":"VALUE(VLOOKUP(RIGHT(C14,5),Reference!$A$2:$H$201,3,FALSE))","v":0}]
[211,null,"R-5                    40311",{"$f":"IF(ISERROR(VLOOKUP(RIGHT(C15,5),Reference!$A$2:$F$201,5,FALSE))=TRUE,0,VLOOKUP(RIGHT(C15,5),Reference!$A$2:$F$201,5,FALSE))","v":0},0,{"$f":"VALUE(VLOOKUP(RIGHT(C15,5),Reference!$A$2:$H$201,4,FALSE))","v":0},{"$f":"VALUE(VLOOKUP(RIGHT(C15,5),Reference!$A$2:$H$201,3,FALSE))","v":0}]
[212,null,"Waste               40312",{"$f":"IF(ISERROR(VLOOKUP(RIGHT(C16,5),Reference!$A$2:$F$201,5,FALSE))=TRUE,0,VLOOKUP(RIGHT(C16,5),Reference!$A$2:$F$201,5,FALSE))","v":0},0,{"$f":"VALUE(VLOOKUP(RIGHT(C16,5),Reference!$A$2:$H$201,4,FALSE))","v":0},{"$f":"VALUE(VLOOKUP(RIGHT(C16,5),Reference!$A$2:$H$201,3,FALSE))","v":0}]
[null,null,"LRA 3            (DOR Code)"]
[213,null,"R-1                    40313",{"$f":"IF(ISERROR(VLOOKUP(RIGHT(C18,5),Reference!$A$2:$F$201,5,FALSE))=TRUE,0,VLOOKUP(RIGHT(C18,5),Reference!$A$2:$F$201,5,FALSE))","v":0},{"$f":"IF(D18>0,F18/D18,0)","v":0},{"$f":"VALUE(VLOOKUP(RIGHT(C18,5),Reference!$A$2:$H$201,4,FALSE))","v":0},{"$f":"VALUE(VLOOKUP(RIGHT(C18,5),Reference!$A$2:$H$201,3,FALSE))","v":0}]
[214,null,"R-2                    40314",{"$f":"IF(ISERROR(VLOOKUP(RIGHT(C19,5),Reference!$A$2:$F$201,5,FALSE))=TRUE,0,VLOOKUP(RIGHT(C19,5),Reference!$A$2:$F$201,5,FALSE))","v":0},0,{"$f":"VALUE(VLOOKUP(RIGHT(C19,5),Reference!$A$2:$H$201,4,FALSE))","v":0},{"$f":"VALUE(VLOOKUP(RIGHT(C19,5),Reference!$A$2:$H$201,3,FALSE))","v":0}]
[215,null,"R-3                    40315",{"$f":"IF(ISERROR(VLOOKUP(RIGHT(C20,5),Reference!$A$2:$F$201,5,FALSE))=TRUE,0,VLOOKUP(RIGHT(C20,5),Reference!$A$2:$F$201,5,FALSE))","v":0},0,{"$f":"VALUE(VLOOKUP(RIGHT(C20,5),Reference!$A$2:$H$201,4,FALSE))","v":0},{"$f":"VALUE(VLOOKUP(RIGHT(C20,5),Reference!$A$2:$H$201,3,FALSE))","v":0}]
[216,null,"R-4                    40316",{"$f":"IF(ISERROR(VLOOKUP(RIGHT(C21,5),Reference!$A$2:$F$201,5,FALSE))=TRUE,0,VLOOKUP(RIGHT(C21,5),Reference!$A$2:$F$201,5,FALSE))","v":0},0,{"$f":"VALUE(VLOOKUP(RIGHT(C21,5),Reference!$A$2:$H$201,4,FALSE))","v":0},{"$f":"VALUE(VLOOKUP(RIGHT(C21,5),Reference!$A$2:$H$201,3,FALSE))","v":0}]
[217,null,"R-5                    40317",{"$f":"IF(ISERROR(VLOOKUP(RIGHT(C22,5),Reference!$A$2:$F$201,5,FALSE))=TRUE,0,VLOOKUP(RIGHT(C22,5),Reference!$A$2:$F$201,5,FALSE))","v":0},0,{"$f":"VALUE(VLOOKUP(RIGHT(C22,5),Reference!$A$2:$H$201,4,FALSE))","v":0},{"$f":"VALUE(VLOOKUP(RIGHT(C22,5),Reference!$A$2:$H$201,3,FALSE))","v":0}]
[218,null,"Waste               40318",{"$f":"IF(ISERROR(VLOOKUP(RIGHT(C23,5),Reference!$A$2:$F$201,5,FALSE))=TRUE,0,VLOOKUP(RIGHT(C23,5),Reference!$A$2:$F$201,5,FALSE))","v":0},0,{"$f":"VALUE(VLOOKUP(RIGHT(C23,5),Reference!$A$2:$H$201,4,FALSE))","v":0},{"$f":"VALUE(VLOOKUP(RIGHT(C23,5),Reference!$A$2:$H$201,3,FALSE))","v":0}]
[null,null,"LRA 4            (DOR Code)"]
[219,null,"R-1                    40313",0,{"$f":"IF(D25>0,F25/D25,0)","v":0},0,0]
[220,null,"R-2                    40314",0,0,0,0]
[221,null,"R-3                    40315",0,0,0,0]
[222,null,"R-4                    40316",0,0,0,0]
[223,null,"R-5                    40317",0,0,0,0]
[224,null,"Waste               40318",0,0,0,0]
[null,null,"LRA 5            (DOR Code)"]
[225,null,"R-1                    40319",{"$f":"IF(ISERROR(VLOOKUP(RIGHT(C32,5),Reference!$A$2:$F$201,5,FALSE))=TRUE,0,VLOOKUP(RIGHT(C32,5),Reference!$A$2:$F$201,5,FALSE))","v":0},{"$f":"IF(D32>0,F32/D32,0)","v":0},{"$f":"VALUE(VLOOKUP(RIGHT(C32,5),Reference!$A$2:$H$201,4,FALSE))","v":0},{"$f":"VALUE(VLOOKUP(RIGHT(C32,5),Reference!$A$2:$H$201,3,FALSE))","v":0}]
[226,null,"R-2                    40320",{"$f":"IF(ISERROR(VLOOKUP(RIGHT(C33,5),Reference!$A$2:$F$201,5,FALSE))=TRUE,0,VLOOKUP(RIGHT(C33,5),Reference!$A$2:$F$201,5,FALSE))","v":0},0,{"$f":"VALUE(VLOOKUP(RIGHT(C33,5),Reference!$A$2:$H$201,4,FALSE))","v":0},{"$f":"VALUE(VLOOKUP(RIGHT(C33,5),Reference!$A$2:$H$201,3,FALSE))","v":0}]
[227,null,"R-3                    40321",{"$f":"IF(ISERROR(VLOOKUP(RIGHT(C34,5),Reference!$A$2:$F$201,5,FALSE))=TRUE,0,VLOOKUP(RIGHT(C34,5),Reference!$A$2:$F$201,5,FALSE))","v":0},0,{"$f":"VALUE(VLOOKUP(RIGHT(C34,5),Reference!$A$2:$H$201,4,FALSE))","v":0},{"$f":"VALUE(VLOOKUP(RIGHT(C34,5),Reference!$A$2:$H$201,3,FALSE))","v":0}]
[228,null,"R-4                    40322",{"$f":"IF(ISERROR(VLOOKUP(RIGHT(C35,5),Reference!$A$2:$F$201,5,FALSE))=TRUE,0,VLOOKUP(RIGHT(C35,5),Reference!$A$2:$F$201,5,FALSE))","v":0},0,{"$f":"VALUE(VLOOKUP(RIGHT(C35,5),Reference!$A$2:$H$201,4,FALSE))","v":0},{"$f":"VALUE(VLOOKUP(RIGHT(C35,5),Reference!$A$2:$H$201,3,FALSE))","v":0}]
[229,null,"R-5                    40323",{"$f":"IF(ISERROR(VLOOKUP(RIGHT(C36,5),Reference!$A$2:$F$201,5,FALSE))=TRUE,0,VLOOKUP(RIGHT(C36,5),Reference!$A$2:$F$201,5,FALSE))","v":0},0,{"$f":"VALUE(VLOOKUP(RIGHT(C36,5),Reference!$A$2:$H$201,4,FALSE))","v":0},{"$f":"VALUE(VLOOKUP(RIGHT(C36,5),Reference!$A$2:$H$201,3,FALSE))","v":0}]
[230,null,"Waste               40324",{"$f":"IF(ISERROR(VLOOKUP(RIGHT(C37,5),Reference!$A$2:$F$201,5,FALSE))=TRUE,0,VLOOKUP(RIGHT(C37,5),Reference!$A$2:$F$201,5,FALSE))","v":0},0,{"$f":"VALUE(VLOOKUP(RIGHT(C37,5),Reference!$A$2:$H$201,4,FALSE))","v":0},{"$f":"VALUE(VLOOKUP(RIGHT(C37,5),Reference!$A$2:$H$201,3,FALSE))","v":0}]
[300,null,"Total Agricultural Range Lands",{"$f":"SUM(D3:D37)","v":0},null,{"$f":"SUM(F4:F37)","v":0},{"$f":"SUM(G3:G37)","v":0}]
[]
["A",null,"TOTAL AGRICULTURAL LANDS (100 + 200 + 300)",{"$f":"'Page 2'!C13+'Page 2'!C30+'Page 3'!D38","v":0},null,{"$f":"'Page 2'!E13+'Page 2'!E30+'Page 3'!F38","v":0},{"$f":"'Page 2'!F13+'Page 2'!F30+'Page 3'!G38","v":0}]

{"sheet":"Page 4","index":3,"n_rows":58,"n_cols":6,"rows_kept":58,"cut":false,"hidden":false,"merged":[[52,3,52,5],[57,0,57,1],[2,3,2,5],[13,3,13,5],[44,0,44,1],[48,3,48,5],[22,3,22,5],[26,3,26,5]]}
[null,"Residential and Commercial Real Property"]
["Line","Abstract Codes","Classification","Fair Market Value","Assessed Value","Sub Total per Line"]
[301,null,"Residential Lands (Includes Farmsteads)  DOR code- 00101, 00102, 00103,\n 00400, 10001, 10002, 10003, 10004, 10005"]
[null,"00101","   Vacant Land- Residential Vacant- In City Limits",{"$f":"IF(ISERROR(VLOOKUP(B4,Reference!$A$2:$F$201,4,FALSE))=TRUE,0,VLOOKUP(RIGHT(B4,5),Reference!$A$2:$F$201,4,FALSE))","v":0},{"$f":"IF(D4<>0,VLOOKUP(RIGHT(B4,5),Reference!$A$2:$H$201,3,FALSE),0)","v":0}]
[null,"00102","   Vacant Land- Residential Vacant- Out of City Limits- Platted",{"$f":"IF(ISERROR(VLOOKUP(B5,Reference!$A$2:$F$201,4,FALSE))=TRUE,0,VLOOKUP(RIGHT(B5,5),Reference!$A$2:$F$201,4,FALSE))","v":0},{"$f":"IF(D5<>0,VLOOKUP(RIGHT(B5,5),Reference!$A$2:$H$201,3,FALSE),0)","v":0}]
[null,"00103","   Vacant Land- Residential Vacant- Out of City Limits- UnPlatted",{"$f":"IF(ISERROR(VLOOKUP(B6,Reference!$A$2:$F$201,4,FALSE))=TRUE,0,VLOOKUP(RIGHT(B6,5),Reference!$A$2:$F$201,4,FALSE))","v":0},{"$f":"IF(D6<>0,VLOOKUP(RIGHT(B6,5),Reference!$A$2:$H$201,3,FALSE),0)","v":0}]
[null,"00400","   Vacant Land- Planned Unit Development Vacant Lots- all inclusive",{"$f":"IF(ISERROR(VLOOKUP(B7,Reference!$A$2:$F$201,4,FALSE))=TRUE,0,VLOOKUP(RIGHT(B7,5),Reference!$A$2:$F$201,4,FALSE))","v":0},{"$f":"IF(D7<>0,VLOOKUP(RIGHT(B7,5),Reference!$A$2:$H$201,3,FALSE),0)","v":0}]
[null,"10001","   Residential- Improved Land- Single Family Residence",{"$f":"IF(ISERROR(VLOOKUP(B8,Reference!$A$2:$F$201,4,FALSE))=TRUE,0,VLOOKUP(RIGHT(B8,5),Reference!$A$2:$F$201,4,FALSE))","v":0},{"$f":"IF(D8<>0,VLOOKUP(RIGHT(B8,5),Reference!$A$2:$H$201,3,FALSE),0)","v":0}]
[null,"10002","   Residential- Improved Land- Agricultural Residence",{"$f":"IF(ISERROR(VLOOKUP(B9,Reference!$A$2:$F$201,4,FALSE))=TRUE,0,VLOOKUP(RIGHT(B9,5),Reference!$A$2:$F$201,4,FALSE))","v":0},{"$f":"IF(D9<>0,VLOOKUP(RIGHT(B9,5),Reference!$A$2:$H$201,3,FALSE),0)","v":0}]
[null,"10003","   Residential- Improved Land- Residential Support/Out Building Only",{"$f":"IF(ISERROR(VLOOKUP(B10,Reference!$A$2:$F$201,4,FALSE))=TRUE,0,VLOOKUP(RIGHT(B10,5),Reference!$A$2:$F$201,4,FALSE))","v":0},{"$f":"IF(D10<>0,VLOOKUP(RIGHT(B10,5),Reference!$A$2:$H$201,3,FALSE),0)","v":0}]
[null,"10004","   Residential- Improved Land- Agricultural Support/Out Building Only",{"$f":"IF(ISERROR(VLOOKUP(B11,Reference!$A$2:$F$201,4,FALSE))=TRUE,0,VLOOKUP(RIGHT(B11,5),Reference!$A$2:$F$201,4,FALSE))","v":0},{"$f":"IF(D11<>0,VLOOKUP(RIGHT(B11,5),Reference!$A$2:$H$201,3,FALSE),0)","v":0}]
[null,"10005","   Residential- Improved Land- Duplex Triplex Townhouse",{"$f":"IF(ISERROR(VLOOKUP(B12,Reference!$A$2:$F$201,4,FALSE))=TRUE,0,VLOOKUP(RIGHT(B12,5),Reference!$A$2:$F$201,4,FALSE))","v":0},{"$f":"IF(D12<>0,VLOOKUP(RIGHT(B12,5),Reference!$A$2:$H$201,3,FALSE),0)","v":0}]
[null,"Sub Total","Total Residential Lands (Line 301)",{"$f":"SUM(D4:D12)","v":0},{"$f":"SUM(E4:E12)","v":0},{"$f":"E13","v":0}]
[302,null,"Residential Improvements (includes residences on farmsteads)  DOR Codes- \n10101, 10102, 10200, 10401, 10402, 10500, 10600"]
[null,"10101","   Residential- Single Family Improvements- Site Built",{"$f":"IF(ISERROR(VLOOKUP(B15,Reference!$A$2:$F$201,4,FALSE))=TRUE,0,VLOOKUP(RIGHT(B15,5),Reference!$A$2:$F$201,4,FALSE))","v":0},{"$f":"IF(D15<>0,VLOOKUP(RIGHT(B15,5),Reference!$A$2:$H$201,3,FALSE),0)","v":0}]
[null,"10102","   Residential- Single Family Improvements- Manufactured Home- Cancelled Title",{"$f":"IF(ISERROR(VLOOKUP(B16,Reference!$A$2:$F$201,4,FALSE))=TRUE,0,VLOOKUP(RIGHT(B16,5),Reference!$A$2:$F$201,4,FALSE))","v":0},{"$f":"IF(D16<>0,VLOOKUP(RIGHT(B16,5),Reference!$A$2:$H$201,3,FALSE),0)","v":0}]
[null,"10200","   Residential- Single Family Improvements- Manufactured Home- Titled",{"$f":"IF(ISERROR(VLOOKUP(B17,Reference!$A$2:$F$201,4,FALSE))=TRUE,0,VLOOKUP(RIGHT(B17,5),Reference!$A$2:$F$201,4,FALSE))","v":0},{"$f":"IF(D17<>0,VLOOKUP(RIGHT(B17,5),Reference!$A$2:$H$201,3,FALSE),0)","v":0}]
[null,"10401","   Residential- Agricultural Residence Improvements- Site Built",{"$f":"IF(ISERROR(VLOOKUP(B18,Reference!$A$2:$F$201,4,FALSE))=TRUE,0,VLOOKUP(RIGHT(B18,5),Reference!$A$2:$F$201,4,FALSE))","v":0},{"$f":"IF(D18<>0,VLOOKUP(RIGHT(B18,5),Reference!$A$2:$H$201,3,FALSE),0)","v":0}]
[null,"10402","   Residential- Agricultural Residence Improvements- Manufactured Home- Cancelled Title",{"$f":"IF(ISERROR(VLOOKUP(B19,Reference!$A$2:$F$201,4,FALSE))=TRUE,0,VLOOKUP(RIGHT(B19,5),Reference!$A$2:$F$201,4,FALSE))","v":0},{"$f":"IF(D19<>0,VLOOKUP(RIGHT(B19,5),Reference!$A$2:$H$201,3,FALSE),0)","v":0}]
[null,"10500","   Residential- Condominiums Improvements- All Inclusive",{"$f":"IF(ISERROR(VLOOKUP(B20,Reference!$A$2:$F$201,4,FALSE))=TRUE,0,VLOOKUP(RIGHT(B20,5),Reference!$A$2:$F$201,4,FALSE))","v":0},{"$f":"IF(D20<>0,VLOOKUP(RIGHT(B20,5),Reference!$A$2:$H$201,3,FALSE),0)","v":0}]
[null,"10600","   Residential- Support/ Out Buildings Only Improvements- All Inclusive",{"$f":"IF(ISERROR(VLOOKUP(B21,Reference!$A$2:$F$201,4,FALSE))=TRUE,0,VLOOKUP(RIGHT(B21,5),Reference!$A$2:$F$201,4,FALSE))","v":0},{"$f":"IF(D21<>0,VLOOKUP(RIGHT(B21,5),Reference!$A$2:$H$201,3,FALSE),0)","v":0}]
[null,"Sub Total","Total Residential Improvements (Line 302)",{"$f":"SUM(D15:D21)","v":0},{"$f":"SUM(E15:E21)","v":0},{"$f":"E22","v":0}]
[303,null,"Commercial Lands DOR Codes- 00200 & 20000"]
[null,"00200","   Vacant Land- Commercial Vacant- All Inclusive",{"$f":"IF(ISERROR(VLOOKUP(B24,Reference!$A$2:$F$201,4,FALSE))=TRUE,0,VLOOKUP(RIGHT(B24,5),Reference!$A$2:$F$201,4,FALSE))","v":0},{"$f":"IF(D24<>0,VLOOKUP(RIGHT(B24,5),Reference!$A$2:$H$201,3,FALSE),0)","v":0}]
[null,"20000","   Vacant Land- Commercial- Improved Land- All Inclusive",{"$f":"IF(ISERROR(VLOOKUP(B25,Reference!$A$2:$F$201,4,FALSE))=TRUE,0,VLOOKUP(RIGHT(B25,5),Reference!$A$2:$F$201,4,FALSE))","v":0},{"$f":"IF(D25<>0,VLOOKUP(RIGHT(B25,5),Reference!$A$2:$H$201,3,FALSE),0)","v":0}]
[null,"Sub Total","Total Commercial Lands (Line 303)",{"$f":"SUM(D24:D25)","v":0},{"$f":"SUM(E24:E25)","v":0},{"$f":"E26","v":0}]
[304,null,"Commercial Improvements DOR Codes- 20100, 20200, 20300, 20400, 20500, 20600, 20701, 20702, 20703, 20800, 20900, 21000, 21100, 21201, 21301, 21302"]
[null,"20100","   Commercial- Merchandising Improvements- All Inclusive",{"$f":"IF(ISERROR(VLOOKUP(B28,Reference!$A$2:$F$201,4,FALSE))=TRUE,0,VLOOKUP(RIGHT(B28,5),Reference!$A$2:$F$201,4,FALSE))","v":0},{"$f":"IF(D28<>0,VLOOKUP(RIGHT(B28,5),Reference!$A$2:$H$201,3,FALSE),0)","v":0}]
[null,"20200","   Commercial- Lodging Improvements- All Inclusive",{"$f":"IF(ISERROR(VLOOKUP(B29,Reference!$A$2:$F$201,4,FALSE))=TRUE,0,VLOOKUP(RIGHT(B29,5),Reference!$A$2:$F$201,4,FALSE))","v":0},{"$f":"IF(D29<>0,VLOOKUP(RIGHT(B29,5),Reference!$A$2:$H$201,3,FALSE),0)","v":0}]
[null,"20300","   Commercial- Offices Improvements- All Inclusive",{"$f":"IF(ISERROR(VLOOKUP(B30,Reference!$A$2:$F$201,4,FALSE))=TRUE,0,VLOOKUP(RIGHT(B30,5),Reference!$A$2:$F$201,4,FALSE))","v":0},{"$f":"IF(D30<>0,VLOOKUP(RIGHT(B30,5),Reference!$A$2:$H$201,3,FALSE),0)","v":0}]
[null,"20400","   Commercial- Recreation Improvements- All Inclusive",{"$f":"IF(ISERROR(VLOOKUP(B31,Reference!$A$2:$F$201,4,FALSE))=TRUE,0,VLOOKUP(RIGHT(B31,5),Reference!$A$2:$F$201,4,FALSE))","v":0},{"$f":"IF(D31<>0,VLOOKUP(RIGHT(B31,5),Reference!$A$2:$H$201,3,FALSE),0)","v":0}]
[null,"20500","   Commercial- Warehouse Storage Improvements- All Inclusive",{"$f":"IF(ISERROR(VLOOKUP(B32,Reference!$A$2:$F$201,4,FALSE))=TRUE,0,VLOOKUP(RIGHT(B32,5),Reference!$A$2:$F$201,4,FALSE))","v":0},{"$f":"IF(D32<>0,VLOOKUP(RIGHT(B32,5),Reference!$A$2:$H$201,3,FALSE),0)","v":0}]
[null,"20600","   Commercial- Special Purpose Improvements- All Inclusive",{"$f":"IF(ISERROR(VLOOKUP(B33,Reference!$A$2:$F$201,4,FALSE))=TRUE,0,VLOOKUP(RIGHT(B33,5),Reference!$A$2:$F$201,4,FALSE))","v":0},{"$f":"IF(D33<>0,VLOOKUP(RIGHT(B33,5),Reference!$A$2:$H$201,3,FALSE),0)","v":0}]
[null,"20701","   Commercial- Multi-Use Improvements- Residential/Commercial",{"$f":"IF(ISERROR(VLOOKUP(B34,Reference!$A$2:$F$201,4,FALSE))=TRUE,0,VLOOKUP(RIGHT(B34,5),Reference!$A$2:$F$201,4,FALSE))","v":0},{"$f":"IF(D34<>0,VLOOKUP(RIGHT(B34,5),Reference!$A$2:$H$201,3,FALSE),0)","v":0}]
[null,"20702","   Commercial- Multi-Use Improvements- Agricultural/Commercial",{"$f":"IF(ISERROR(VLOOKUP(B35,Reference!$A$2:$F$201,4,FALSE))=TRUE,0,VLOOKUP(RIGHT(B35,5),Reference!$A$2:$F$201,4,FALSE))","v":0},{"$f":"IF(D35<>0,VLOOKUP(RIGHT(B35,5),Reference!$A$2:$H$201,3,FALSE),0)","v":0}]
[null,"20703","   Commercial- Multi-Use Improvements- Non-Exempt Portion (partial exempt)",{"$f":"IF(ISERROR(VLOOKUP(B36,Reference!$A$2:$F$201,4,FALSE))=TRUE,0,VLOOKUP(RIGHT(B36,5),Reference!$A$2:$F$201,4,FALSE))","v":0},{"$f":"IF(D36<>0,VLOOKUP(RIGHT(B36,5),Reference!$A$2:$H$201,3,FALSE),0)","v":0}]
[null,"20800","   Commercial- Food Service Improvements- All Inclusive",{"$f":"IF(ISERROR(VLOOKUP(B37,Reference!$A$2:$F$201,4,FALSE))=TRUE,0,VLOOKUP(RIGHT(B37,5),Reference!$A$2:$F$201,4,FALSE))","v":0},{"$f":"IF(D37<>0,VLOOKUP(RIGHT(B37,5),Reference!$A$2:$H$201,3,FALSE),0)","v":0}]
[null,"20900","   Commercial- Service/Repair Oriented Improvements- All Inclusive",{"$f":"IF(ISERROR(VLOOKUP(B38,Reference!$A$2:$F$201,4,FALSE))=TRUE,0,VLOOKUP(RIGHT(B38,5),Reference!$A$2:$F$201,4,FALSE))","v":0},{"$f":"IF(D38<>0,VLOOKUP(RIGHT(B38,5),Reference!$A$2:$H$201,3,FALSE),0)","v":0}]
[null,"21000","   Commercial- Support/Out Buildings Only Improvements- All Inclusive",{"$f":"IF(ISERROR(VLOOKUP(B39,Reference!$A$2:$F$201,4,FALSE))=TRUE,0,VLOOKUP(RIGHT(B39,5),Reference!$A$2:$F$201,4,FALSE))","v":0},{"$f":"IF(D39<>0,VLOOKUP(RIGHT(B39,5),Reference!$A$2:$H$201,3,FALSE),0)","v":0}]
[null,"21100","   Commercial- Manufactured Housing / RV Parks Improvements- All Inclusive",{"$f":"IF(ISERROR(VLOOKUP(B40,Reference!$A$2:$F$201,4,FALSE))=TRUE,0,VLOOKUP(RIGHT(B40,5),Reference!$A$2:$F$201,4,FALSE))","v":0},{"$f":"IF(D40<>0,VLOOKUP(RIGHT(B40,5),Reference!$A$2:$H$201,3,FALSE),0)","v":0}]
[null,"21201","   Commercial- Apartment Building Improvements- 4 or more Units",{"$f":"IF(ISERROR(VLOOKUP(B41,Reference!$A$2:$F$201,4,FALSE))=TRUE,0,VLOOKUP(RIGHT(B41,5),Reference!$A$2:$F$201,4,FALSE))","v":0},{"$f":"IF(D41<>0,VLOOKUP(RIGHT(B41,5),Reference!$A$2:$H$201,3,FALSE),0)","v":0}]
[null,"21301","   Commercial- Manufactured Home Improvements- Used as Office - Canceled Title",{"$f":"IF(ISERROR(VLOOKUP(B42,Reference!$A$2:$F$201,4,FALSE))=TRUE,0,VLOOKUP(RIGHT(B42,5),Reference!$A$2:$F$201,4,FALSE))","v":0},{"$f":"IF(D42<>0,VLOOKUP(RIGHT(B42,5),Reference!$A$2:$H$201,3,FALSE),0)","v":0}]
[null,"21302","   Commercial- Manufactured Home Improvements- Used as On site Living Qtrs. - Canceled Title",{"$f":"IF(ISERROR(VLOOKUP(B43,Reference!$A$2:$F$201,4,FALSE))=TRUE,0,VLOOKUP(RIGHT(B43,5),Reference!$A$2:$F$201,4,FALSE))","v":0},{"$f":"IF(D43<>0,VLOOKUP(RIGHT(B43,5),Reference!$A$2:$H$201,3,FALSE),0)","v":0}]
[null,"Sub Total","Total Commercial Improvements (Line 304)",{"$f":"SUM(D28:D43)","v":0},{"$f":"SUM(E28:E43)","v":0},{"$f":"E44","v":0}]
["B",null,"TOTAL RESIDENTIAL & COMMERCIAL REAL PROPERTY",{"$f":"D13+D22+D26+D44","v":0},{"$f":"E13+E22+E26+E44","v":0},{"$f":"F13+F22+F26+F44","v":0}]
[]
[null,"Residential and Commercial Personal Property"]
["Line","Abstract Codes","Classification","Fair Market Value","Assessed Value","Sub Total per Line"]
[401,null,"Residential Personal Property (DOR code)- 10103 + 10403"]
[null,"10103","   Residential- Single Family Residential Improvements- Manufactured Home- Cancelled Title",{"$f":"IF(ISERROR(VLOOKUP(B50,Reference!$A$2:$F$201,4,FALSE))=TRUE,0,VLOOKUP(RIGHT(B50,5),Reference!$A$2:$F$201,4,FALSE))","v":0},{"$f":"IF(D50<>0,VLOOKUP(RIGHT(B50,5),Reference!$A$2:$H$201,3,FALSE),0)","v":0}]
[null,"10403","   Residential- Agricultural Residence Improvements- Manufactured Home- Titled",{"$f":"IF(ISERROR(VLOOKUP(B51,Reference!$A$2:$F$201,4,FALSE))=TRUE,0,VLOOKUP(RIGHT(B51,5),Reference!$A$2:$F$201,4,FALSE))","v":0},{"$f":"IF(D51<>0,VLOOKUP(RIGHT(B51,5),Reference!$A$2:$H$201,3,FALSE),0)","v":0}]
[null,"Sub Total","Total Residential Personal Property (Line 401)",{"$f":"SUM(D50:D51)","v":0},{"$f":"SUM(E50:E51)","v":0},{"$f":"E52","v":0}]
[402,null,"Commercial Personal Property (DOR Code)- 21303 + 21304 + 29900"]
[null,"21303","   Commercial- Manufactured Home Improvements- Used as Office- Titled",{"$f":"IF(ISERROR(VLOOKUP(B54,Reference!$A$2:$F$201,4,FALSE))=TRUE,0,VLOOKUP(RIGHT(B54,5),Reference!$A$2:$F$201,4,FALSE))","v":0},{"$f":"IF(D54<>0,VLOOKUP(RIGHT(B54,5),Reference!$A$2:$H$201,3,FALSE),0)","v":0}]
[null,"21304","   Commercial- Manufactured Home Improvements- Used as on Site Living Qtrs. - Titled",{"$f":"IF(ISERROR(VLOOKUP(B55,Reference!$A$2:$F$201,4,FALSE))=TRUE,0,VLOOKUP(RIGHT(B55,5),Reference!$A$2:$F$201,4,FALSE))","v":0},{"$f":"IF(D55<>0,VLOOKUP(RIGHT(B55,5),Reference!$A$2:$H$201,3,FALSE),0)","v":0}]
[null,"29900","   Commercial- Personal Property- All Inclusive",{"$f":"IF(ISERROR(VLOOKUP(B56,Reference!$A$2:$F$201,4,FALSE))=TRUE,0,VLOOKUP(RIGHT(B56,5),Reference!$A$2:$F$201,4,FALSE))","v":0},{"$f":"IF(D56<>0,VLOOKUP(RIGHT(B56,5),Reference!$A$2:$H$201,3,FALSE),0)","v":0}]
[null,"Sub Total","Total Commercial Personal Property (Line 402)",{"$f":"SUM(D54:D56)","v":0},{"$f":"SUM(E54:E56)","v":0},{"$f":"E57","v":0}]
["C",null,"TOTAL RESIDENTIAL & COMMERCIAL PERSONAL PROPERTY",{"$f":"D52+D57","v":0},{"$f":"E52+E57","v":0},{"$f":"F52+F57","v":0}]

{"sheet":"Page 5","index":4,"n_rows":32,"n_cols":9,"rows_kept":32,"cut":false,"hidden":false,"merged":[[7,0,11,0],[7,2,11,2],[2,2,5,2],[2,0,5,0],[22,0,26,0],[22,2,26,2],[27,0,31,0],[27,2,31,2],[12,2,16,2],[12,0,16,0],[17,0,21,0],[17,2,21,2]]}
["Industrial Property"]
["Line","Abstract Code","NAICS","Primary Activity","LAND (FMV)","Improvements (FMV)","Personal Property (FMV)","Total Fair Market Value","TOTAL ASSESSED VALUE"]
[501,"30001","3111 \nthru\n3119","Industrial- Improved Land- Food",{"$f":"IF(ISERROR(VLOOKUP(B3,Reference!$A$2:$F$201,4,FALSE))=TRUE,0,VLOOKUP(RIGHT(B3,5),Reference!$A$2:$F$201,4,FALSE))","v":0},0,0,{"$f":"E3+F3+G3","v":0},{"$f":"IF(H3<>0,VLOOKUP(RIGHT(B3,5),Reference!$A$2:$H$196,3,FALSE),0)","v":0}]
[null,"30101",null,"Industrial- Manufacturing- Food",0,{"$f":"IF(ISERROR(VLOOKUP(B4,Reference!$A$2:$F$201,4,FALSE))=TRUE,0,VLOOKUP(RIGHT(B4,5),Reference!$A$2:$F$201,4,FALSE))","v":0},0,{"$f":"E4+F4+G4","v":0},{"$f":"VLOOKUP(RIGHT(B4,5),Reference!$A$2:$H$196,3,FALSE)","v":0}]
[null,"30401",null,"Industrial- Support/ Out Buildings Only- Food",0,{"$f":"IF(ISERROR(VLOOKUP(B5,Reference!$A$2:$F$201,4,FALSE))=TRUE,0,VLOOKUP(RIGHT(B5,5),Reference!$A$2:$F$201,4,FALSE))","v":0},0,0,{"$f":"VLOOKUP(RIGHT(B5,5),Reference!$A$2:$H$196,3,FALSE)","v":0}]
[null,"39901",null,"Industrial- Personal Property- Food",0,0,{"$f":"IF(ISERROR(VLOOKUP(B6,Reference!$A$2:$F$201,4,FALSE))=TRUE,0,VLOOKUP(RIGHT(B6,5),Reference!$A$2:$F$201,4,FALSE))","v":0},{"$f":"E6+F6+G6","v":0},{"$f":"VLOOKUP(RIGHT(B6,5),Reference!$A$2:$H$196,3,FALSE)","v":0}]
[null,null,null,"Sub Total of Line 501",{"$f":"SUM(E3:E6)","v":0},{"$f":"SUM(F3:F6)","v":0},{"$f":"SUM(G3:G6)","v":0},{"$f":"SUM(H3:H6)","v":0},{"$f":"SUM(I3:I6)","v":0}]
[502,"30002",3121,"Industrial- Improved Land- Beverage",{"$f":"IF(ISERROR(VLOOKUP(B8,Reference!$A$2:$F$201,4,FALSE))=TRUE,0,VLOOKUP(RIGHT(B8,5),Reference!$A$2:$F$201,4,FALSE))","v":0},0,0,0,{"$f":"VLOOKUP(RIGHT(B8,5),Reference!$A$2:$H$196,3,FALSE)","v":0}]
[null,"30102",null,"Industrial- Manufacturing- Beverage",0,{"$f":"IF(ISERROR(VLOOKUP(B9,Reference!$A$2:$F$201,4,FALSE))=TRUE,0,VLOOKUP(RIGHT(B9,5),Reference!$A$2:$F$201,4,FALSE))","v":0},0,0,{"$f":"VLOOKUP(RIGHT(B9,5),Reference!$A$2:$H$196,3,FALSE)","v":0}]
[null,"30402",null,"Industrial- Support/ Out Buildings Only- Beverage",0,{"$f":"IF(ISERROR(VLOOKUP(B10,Reference!$A$2:$F$201,4,FALSE))=TRUE,0,VLOOKUP(RIGHT(B10,5),Reference!$A$2:$F$201,4,FALSE))","v":0},0,0,{"$f":"VLOOKUP(RIGHT(B10,5),Reference!$A$2:$H$196,3,FALSE)","v":0}]
[null,"39902",null,"Industrial- Personal Property- Beverage",0,0,{"$f":"IF(ISERROR(VLOOKUP(B11,Reference!$A$2:$F$201,4,FALSE))=TRUE,0,VLOOKUP(RIGHT(B11,5),Reference!$A$2:$F$201,4,FALSE))","v":0},{"$f":"E11+F11+G11","v":0},{"$f":"VLOOKUP(RIGHT(B11,5),Reference!$A$2:$H$196,3,FALSE)","v":0}]
[null,null,null,"Sub Total of Line 502",{"$f":"SUM(E8:E11)","v":0},{"$f":"SUM(F8:F11)","v":0},{"$f":"SUM(G8:G11)","v":0},{"$f":"SUM(H8:H11)","v":0},{"$f":"SUM(I8:I11)","v":0}]
[503,"30003",3122,"Industrial- Improved Land- Tobacco",{"$f":"IF(ISERROR(VLOOKUP(B13,Reference!$A$2:$F$201,4,FALSE))=TRUE,0,VLOOKUP(RIGHT(B13,5),Reference!$A$2:$F$201,4,FALSE))","v":0},0,0,0,{"$f":"VLOOKUP(RIGHT(B13,5),Reference!$A$2:$H$196,3,FALSE)","v":0}]
[null,"30103",null,"Industrial- Manufacturing- Tobacco",0,{"$f":"IF(ISERROR(VLOOKUP(B14,Reference!$A$2:$F$201,4,FALSE))=TRUE,0,VLOOKUP(RIGHT(B14,5),Reference!$A$2:$F$201,4,FALSE))","v":0},0,0,{"$f":"VLOOKUP(RIGHT(B14,5),Reference!$A$2:$H$196,3,FALSE)","v":0}]
[null,"30403",null,"Industrial- Support/ Out Buildings Only- Tobacco",0,{"$f":"IF(ISERROR(VLOOKUP(B15,Reference!$A$2:$F$201,4,FALSE))=TRUE,0,VLOOKUP(RIGHT(B15,5),Reference!$A$2:$F$201,4,FALSE))","v":0},0,0,{"$f":"VLOOKUP(RIGHT(B15,5),Reference!$A$2:$H$196,3,FALSE)","v":0}]
[null,"39903",null,"Industrial- Personal Property- Tobacco",0,0,{"$f":"IF(ISERROR(VLOOKUP(B16,Reference!$A$2:$F$201,4,FALSE))=TRUE,0,VLOOKUP(RIGHT(B16,5),Reference!$A$2:$F$201,4,FALSE))","v":0},{"$f":"E16+F16+G16","v":0},{"$f":"VLOOKUP(RIGHT(B16,5),Reference!$A$2:$H$196,3,FALSE)","v":0}]
[null,null,null,"Sub Total of Line 503",{"$f":"SUM(E13:E16)","v":0},{"$f":"SUM(F13:F16)","v":0},{"$f":"SUM(G13:G16)","v":0},{"$f":"SUM(H13:H16)","v":0},{"$f":"SUM(I13:I16)","v":0}]
[504,"30004","3131\nthru\n3149","Industrial- Improved Land- Textiles",{"$f":"IF(ISERROR(VLOOKUP(B18,Reference!$A$2:$F$201,4,FALSE))=TRUE,0,VLOOKUP(RIGHT(B18,5),Reference!$A$2:$F$201,4,FALSE))","v":0},0,0,0,{"$f":"VLOOKUP(RIGHT(B18,5),Reference!$A$2:$H$196,3,FALSE)","v":0}]
[null,"30104",null,"Industrial- Manufacturing- Textiles",0,{"$f":"IF(ISERROR(VLOOKUP(B19,Reference!$A$2:$F$201,4,FALSE))=TRUE,0,VLOOKUP(RIGHT(B19,5),Reference!$A$2:$F$201,4,FALSE))","v":0},0,0,{"$f":"VLOOKUP(RIGHT(B19,5),Reference!$A$2:$H$196,3,FALSE)","v":0}]
[null,"30404",null,"Industrial- Support/ Out Buildings Only- Textiles",0,{"$f":"IF(ISERROR(VLOOKUP(B20,Reference!$A$2:$F$201,4,FALSE))=TRUE,0,VLOOKUP(RIGHT(B20,5),Reference!$A$2:$F$201,4,FALSE))","v":0},0,0,{"$f":"VLOOKUP(RIGHT(B20,5),Reference!$A$2:$H$196,3,FALSE)","v":0}]
[null,"39904",null,"Industrial- Personal Property- Textiles",0,0,{"$f":"IF(ISERROR(VLOOKUP(B21,Reference!$A$2:$F$201,4,FALSE))=TRUE,0,VLOOKUP(RIGHT(B21,5),Reference!$A$2:$F$201,4,FALSE))","v":0},{"$f":"E21+F21+G21","v":0},{"$f":"VLOOKUP(RIGHT(B21,5),Reference!$A$2:$H$196,3,FALSE)","v":0}]
[null,null,null,"Sub Total of Line 504",{"$f":"SUM(E18:E21)","v":0},{"$f":"SUM(F18:F21)","v":0},{"$f":"SUM(G18:G21)","v":0},{"$f":"SUM(H18:H21)","v":0},{"$f":"SUM(I18:I21)","v":0}]
[505,"30005","3151\nthru\n3159","Industrial- Improved Land- Apparel",{"$f":"IF(ISERROR(VLOOKUP(B23,Reference!$A$2:$F$201,4,FALSE))=TRUE,0,VLOOKUP(RIGHT(B23,5),Reference!$A$2:$F$201,4,FALSE))","v":0},0,0,0,{"$f":"VLOOKUP(RIGHT(B23,5),Reference!$A$2:$H$196,3,FALSE)","v":0}]
[null,"30105",null,"Industrial- Manufacturing- Apparel",0,{"$f":"IF(ISERROR(VLOOKUP(B24,Reference!$A$2:$F$201,4,FALSE))=TRUE,0,VLOOKUP(RIGHT(B24,5),Reference!$A$2:$F$201,4,FALSE))","v":0},0,0,{"$f":"VLOOKUP(RIGHT(B24,5),Reference!$A$2:$H$196,3,FALSE)","v":0}]
[null,"30405",null,"Industrial- Support/ Out Buildings Only- Apparel",0,{"$f":"IF(ISERROR(VLOOKUP(B25,Reference!$A$2:$F$201,4,FALSE))=TRUE,0,VLOOKUP(RIGHT(B25,5),Reference!$A$2:$F$201,4,FALSE))","v":0},0,0,{"$f":"VLOOKUP(RIGHT(B25,5),Reference!$A$2:$H$196,3,FALSE)","v":0}]
[null,"39905",null,"Industrial- Personal Property- Apparel",0,0,{"$f":"IF(ISERROR(VLOOKUP(B26,Reference!$A$2:$F$201,4,FALSE))=TRUE,0,VLOOKUP(RIGHT(B26,5),Reference!$A$2:$F$201,4,FALSE))","v":0},{"$f":"E26+F26+G26","v":0},{"$f":"VLOOKUP(RIGHT(B26,5),Reference!$A$2:$H$196,3,FALSE)","v":0}]
[null,null,null,"Sub Total of Line 505",{"$f":"SUM(E23:E26)","v":0},{"$f":"SUM(F23:F26)","v":0},{"$f":"SUM(G23:G26)","v":0},{"$f":"SUM(H23:H26)","v":0},{"$f":"SUM(I23:I26)","v":0}]
[506,"30006","3161\nthru\n3169","Industrial- Improved Land- Leather",{"$f":"IF(ISERROR(VLOOKUP(B28,Reference!$A$2:$F$201,4,FALSE))=TRUE,0,VLOOKUP(RIGHT(B28,5),Reference!$A$2:$F$201,4,FALSE))","v":0},0,0,0,{"$f":"VLOOKUP(RIGHT(B28,5),Reference!$A$2:$H$196,3,FALSE)","v":0}]
[null,"30106",null,"Industrial- Manufacturing- Leather",0,{"$f":"IF(ISERROR(VLOOKUP(B29,Reference!$A$2:$F$201,4,FALSE))=TRUE,0,VLOOKUP(RIGHT(B29,5),Reference!$A$2:$F$201,4,FALSE))","v":0},0,0,{"$f":"VLOOKUP(RIGHT(B29,5),Reference!$A$2:$H$196,3,FALSE)","v":0}]
[null,"30406",null,"Industrial- Support/ Out Buildings Only- Leather",0,{"$f":"IF(ISERROR(VLOOKUP(B30,Reference!$A$2:$F$201,4,FALSE))=TRUE,0,VLOOKUP(RIGHT(B30,5),Reference!$A$2:$F$201,4,FALSE))","v":0},0,0,{"$f":"VLOOKUP(RIGHT(B30,5),Reference!$A$2:$H$196,3,FALSE)","v":0}]
[null,"39906",null,"Industrial- Personal Property- Textiles",0,0,{"$f":"IF(ISERROR(VLOOKUP(B31,Reference!$A$2:$F$201,4,FALSE))=TRUE,0,VLOOKUP(RIGHT(B31,5),Reference!$A$2:$F$201,4,FALSE))","v":0},{"$f":"E31+F31+G31","v":0},{"$f":"VLOOKUP(RIGHT(B31,5),Reference!$A$2:$H$196,3,FALSE)","v":0}]
[null,null,null,"Sub Total of Line 506",{"$f":"SUM(E28:E31)","v":0},{"$f":"SUM(F28:F31)","v":0},{"$f":"SUM(G28:G31)","v":0},{"$f":"SUM(H28:H31)","v":0},{"$f":"SUM(I28:I31)","v":0}]

{"sheet":"Page 6","index":5,"n_rows":32,"n_cols":9,"rows_kept":32,"cut":false,"hidden":false,"merged":[[17,0,21,0],[17,2,21,2],[22,0,26,0],[22,2,26,2],[27,0,31,0],[27,2,31,2],[7,0,11,0],[7,2,11,2],[2,0,5,0],[2,2,5,2],[12,0,16,0],[12,2,16,2]]}
["Industrial Property"]
["Line","DOR","NAICS","Primary Activity","LAND (FMV)","Improvements (FMV)","Personal Property (FMV)","Total Fair Market Value","TOTAL ASSESSED VALUE"]
[507,"30007","3211 \nthru\n3219","Industrial- Improved Land- Wood Product",{"$f":"IF(ISERROR(VLOOKUP(B3,Reference!$A$2:$F$201,4,FALSE))=TRUE,0,VLOOKUP(RIGHT(B3,5),Reference!$A$2:$F$201,4,FALSE))","v":0},0,0,{"$f":"E3+F3+G3","v":0},{"$f":"IF(H3<>0,VLOOKUP(RIGHT(B3,5),Reference!$A$2:$H$196,3,FALSE),0)","v":0}]
[null,"30107",null,"Industrial- Manufacturing- Wood Product",0,{"$f":"IF(ISERROR(VLOOKUP(B4,Reference!$A$2:$F$201,4,FALSE))=TRUE,0,VLOOKUP(RIGHT(B4,5),Reference!$A$2:$F$201,4,FALSE))","v":0},0,{"$f":"E4+F4+G4","v":0},{"$f":"IF(H4<>0,VLOOKUP(RIGHT(B4,5),Reference!$A$2:$H$196,3,FALSE),0)","v":0}]
[null,"30407",null,"Industrial- Support/Out Building Only- Wood Product",0,{"$f":"IF(ISERROR(VLOOKUP(B5,Reference!$A$2:$F$201,4,FALSE))=TRUE,0,VLOOKUP(RIGHT(B5,5),Reference!$A$2:$F$201,4,FALSE))","v":0},0,0,{"$f":"IF(H5<>0,VLOOKUP(RIGHT(B5,5),Reference!$A$2:$H$196,3,FALSE),0)","v":0}]
[null,"39907",null,"Industrial- Personal Property- Wood Product",0,0,{"$f":"IF(ISERROR(VLOOKUP(B6,Reference!$A$2:$F$201,4,FALSE))=TRUE,0,VLOOKUP(RIGHT(B6,5),Reference!$A$2:$F$201,4,FALSE))","v":0},{"$f":"E6+F6+G6","v":0},{"$f":"IF(H6<>0,VLOOKUP(RIGHT(B6,5),Reference!$A$2:$H$196,3,FALSE),0)","v":0}]
[null,null,null,"Sub Total of Line 507",{"$f":"SUM(E3:E6)","v":0},{"$f":"SUM(F3:F6)","v":0},{"$f":"SUM(G3:G6)","v":0},{"$f":"SUM(H3:H6)","v":0},{"$f":"SUM(I3:I6)","v":0}]
[508,"30008","3221 \nthru\n3222","Industrial- Improved Land- Paper",{"$f":"IF(ISERROR(VLOOKUP(B8,Reference!$A$2:$F$201,4,FALSE))=TRUE,0,VLOOKUP(RIGHT(B8,5),Reference!$A$2:$F$201,4,FALSE))","v":0},0,0,0,{"$f":"IF(H8<>0,VLOOKUP(RIGHT(B8,5),Reference!$A$2:$H$196,3,FALSE),0)","v":0}]
[null,"30108",null,"Industrial- Manufacturing- Paper",0,{"$f":"IF(ISERROR(VLOOKUP(B9,Reference!$A$2:$F$201,4,FALSE))=TRUE,0,VLOOKUP(RIGHT(B9,5),Reference!$A$2:$F$201,4,FALSE))","v":0},0,0,{"$f":"IF(H9<>0,VLOOKUP(RIGHT(B9,5),Reference!$A$2:$H$196,3,FALSE),0)","v":0}]
[null,"30408",null,"Industrial- Support/Out Building Only- Paper",0,{"$f":"IF(ISERROR(VLOOKUP(B10,Reference!$A$2:$F$201,4,FALSE))=TRUE,0,VLOOKUP(RIGHT(B10,5),Reference!$A$2:$F$201,4,FALSE))","v":0},0,0,{"$f":"IF(H10<>0,VLOOKUP(RIGHT(B10,5),Reference!$A$2:$H$196,3,FALSE),0)","v":0}]
[null,"39908",null,"Industrial- Personal Property- Paper",0,0,{"$f":"IF(ISERROR(VLOOKUP(B11,Reference!$A$2:$F$201,4,FALSE))=TRUE,0,VLOOKUP(RIGHT(B11,5),Reference!$A$2:$F$201,4,FALSE))","v":0},{"$f":"E11+F11+G11","v":0},{"$f":"IF(H11<>0,VLOOKUP(RIGHT(B11,5),Reference!$A$2:$H$196,3,FALSE),0)","v":0}]
[null,null,null,"Sub Total of Line 508",{"$f":"SUM(E8:E11)","v":0},{"$f":"SUM(F8:F11)","v":0},{"$f":"SUM(G8:G11)","v":0},{"$f":"SUM(H8:H11)","v":0},{"$f":"SUM(I8:I11)","v":0}]
[509,"30009",3231,"Industrial- Improved Land- Printing",{"$f":"IF(ISERROR(VLOOKUP(B13,Reference!$A$2:$F$201,4,FALSE))=TRUE,0,VLOOKUP(RIGHT(B13,5),Reference!$A$2:$F$201,4,FALSE))","v":0},0,0,0,{"$f":"IF(H13<>0,VLOOKUP(RIGHT(B13,5),Reference!$A$2:$H$196,3,FALSE),0)","v":0}]
[null,"30109",null,"Industrial- Manufacturing- Printing",0,{"$f":"IF(ISERROR(VLOOKUP(B14,Reference!$A$2:$F$201,4,FALSE))=TRUE,0,VLOOKUP(RIGHT(B14,5),Reference!$A$2:$F$201,4,FALSE))","v":0},0,0,{"$f":"IF(H14<>0,VLOOKUP(RIGHT(B14,5),Reference!$A$2:$H$196,3,FALSE),0)","v":0}]
[null,"30409",null,"Industrial- Support/Out Building Only- Printing",0,{"$f":"IF(ISERROR(VLOOKUP(B15,Reference!$A$2:$F$201,4,FALSE))=TRUE,0,VLOOKUP(RIGHT(B15,5),Reference!$A$2:$F$201,4,FALSE))","v":0},0,0,{"$f":"IF(H15<>0,VLOOKUP(RIGHT(B15,5),Reference!$A$2:$H$196,3,FALSE),0)","v":0}]
[null,"39909",null,"Industrial- Personal Property- Printing",0,0,{"$f":"IF(ISERROR(VLOOKUP(B16,Reference!$A$2:$F$201,4,FALSE))=TRUE,0,VLOOKUP(RIGHT(B16,5),Reference!$A$2:$F$201,4,FALSE))","v":0},{"$f":"E16+F16+G16","v":0},{"$f":"IF(H16<>0,VLOOKUP(RIGHT(B16,5),Reference!$A$2:$H$196,3,FALSE),0)","v":0}]
[null,null,null,"Sub Total of Line 509",{"$f":"SUM(E13:E16)","v":0},{"$f":"SUM(F13:F16)","v":0},{"$f":"SUM(G13:G16)","v":0},{"$f":"SUM(H13:H16)","v":0},{"$f":"SUM(I13:I16)","v":0}]
[510,"30010","3252\nthru\n3259","Industrial- Improved Land- Chemical",{"$f":"IF(ISERROR(VLOOKUP(B18,Reference!$A$2:$F$201,4,FALSE))=TRUE,0,VLOOKUP(RIGHT(B18,5),Reference!$A$2:$F$201,4,FALSE))","v":0},0,0,0,{"$f":"IF(H18<>0,VLOOKUP(RIGHT(B18,5),Reference!$A$2:$H$196,3,FALSE),0)","v":0}]
[null,"30110",null,"Industrial- Manufacturing- Chemical",0,{"$f":"IF(ISERROR(VLOOKUP(B19,Reference!$A$2:$F$201,4,FALSE))=TRUE,0,VLOOKUP(RIGHT(B19,5),Reference!$A$2:$F$201,4,FALSE))","v":0},0,0,{"$f":"IF(H19<>0,VLOOKUP(RIGHT(B19,5),Reference!$A$2:$H$196,3,FALSE),0)","v":0}]
[null,"30410",null,"Industrial- Support/Out Building Only- Chemical",0,{"$f":"IF(ISERROR(VLOOKUP(B20,Reference!$A$2:$F$201,4,FALSE))=TRUE,0,VLOOKUP(RIGHT(B20,5),Reference!$A$2:$F$201,4,FALSE))","v":0},0,0,{"$f":"IF(H20<>0,VLOOKUP(RIGHT(B20,5),Reference!$A$2:$H$196,3,FALSE),0)","v":0}]
[null,"39910",null,"Industrial- Personal Property- Chemical",0,0,{"$f":"IF(ISERROR(VLOOKUP(B21,Reference!$A$2:$F$201,4,FALSE))=TRUE,0,VLOOKUP(RIGHT(B21,5),Reference!$A$2:$F$201,4,FALSE))","v":0},{"$f":"E21+F21+G21","v":0},{"$f":"IF(H21<>0,VLOOKUP(RIGHT(B21,5),Reference!$A$2:$H$196,3,FALSE),0)","v":0}]
[null,null,null,"Sub Total of Line 510",{"$f":"SUM(E18:E21)","v":0},{"$f":"SUM(F18:F21)","v":0},{"$f":"SUM(G18:G21)","v":0},{"$f":"SUM(H18:H21)","v":0},{"$f":"SUM(I18:I21)","v":0}]
[511,"30011","3261\nthru\n3262","Industrial- Improved Land- Plastic/Rubber",{"$f":"IF(ISERROR(VLOOKUP(B23,Reference!$A$2:$F$201,4,FALSE))=TRUE,0,VLOOKUP(RIGHT(B23,5),Reference!$A$2:$F$201,4,FALSE))","v":0},0,0,0,{"$f":"IF(H23<>0,VLOOKUP(RIGHT(B23,5),Reference!$A$2:$H$196,3,FALSE),0)","v":0}]
[null,"30111",null,"Industrial- Manufacturing- Plastic/Rubber",0,{"$f":"IF(ISERROR(VLOOKUP(B24,Reference!$A$2:$F$201,4,FALSE))=TRUE,0,VLOOKUP(RIGHT(B24,5),Reference!$A$2:$F$201,4,FALSE))","v":0},0,0,{"$f":"IF(H24<>0,VLOOKUP(RIGHT(B24,5),Reference!$A$2:$H$196,3,FALSE),0)","v":0}]
[null,"30411",null,"Industrial- Support/Out Building Only- Plastic/Rubber",0,{"$f":"IF(ISERROR(VLOOKUP(B25,Reference!$A$2:$F$201,4,FALSE))=TRUE,0,VLOOKUP(RIGHT(B25,5),Reference!$A$2:$F$201,4,FALSE))","v":0},0,0,{"$f":"IF(H25<>0,VLOOKUP(RIGHT(B25,5),Reference!$A$2:$H$196,3,FALSE),0)","v":0}]
[null,"39911",null,"Industrial- Personal Property- Plastic/Rubber",0,0,{"$f":"IF(ISERROR(VLOOKUP(B26,Reference!$A$2:$F$201,4,FALSE))=TRUE,0,VLOOKUP(RIGHT(B26,5),Reference!$A$2:$F$201,4,FALSE))","v":0},{"$f":"E26+F26+G26","v":0},{"$f":"IF(H26<>0,VLOOKUP(RIGHT(B26,5),Reference!$A$2:$H$196,3,FALSE),0)","v":0}]
[null,null,null,"Sub Total of Line 511",{"$f":"SUM(E23:E26)","v":0},{"$f":"SUM(F23:F26)","v":0},{"$f":"SUM(G23:G26)","v":0},{"$f":"SUM(H23:H26)","v":0},{"$f":"SUM(I23:I26)","v":0}]
[512,"30012","3271\nthru\n3279","Industrial- Improved Land- Non-Metallic Mineral Product",{"$f":"IF(ISERROR(VLOOKUP(B28,Reference!$A$2:$F$201,4,FALSE))=TRUE,0,VLOOKUP(RIGHT(B28,5),Reference!$A$2:$F$201,4,FALSE))","v":0},0,0,0,{"$f":"IF(H28<>0,VLOOKUP(RIGHT(B28,5),Reference!$A$2:$H$196,3,FALSE),0)","v":0}]
[null,"30112",null,"Industrial- Manufacturing- Non-Metallic Mineral Product",0,{"$f":"IF(ISERROR(VLOOKUP(B29,Reference!$A$2:$F$201,4,FALSE))=TRUE,0,VLOOKUP(RIGHT(B29,5),Reference!$A$2:$F$201,4,FALSE))","v":0},0,0,{"$f":"IF(H29<>0,VLOOKUP(RIGHT(B29,5),Reference!$A$2:$H$196,3,FALSE),0)","v":0}]
[null,"30412",null,"Industrial- Support/Out Building Only- Non-Metallic Mineral Product",0,{"$f":"IF(ISERROR(VLOOKUP(B30,Reference!$A$2:$F$201,4,FALSE))=TRUE,0,VLOOKUP(RIGHT(B30,5),Reference!$A$2:$F$201,4,FALSE))","v":0},0,0,{"$f":"IF(H30<>0,VLOOKUP(RIGHT(B30,5),Reference!$A$2:$H$196,3,FALSE),0)","v":0}]
[null,"39912",null,"Industrial- Personal Property- Non-Metallic Mineral Product",0,0,{"$f":"IF(ISERROR(VLOOKUP(B31,Reference!$A$2:$F$201,4,FALSE))=TRUE,0,VLOOKUP(RIGHT(B31,5),Reference!$A$2:$F$201,4,FALSE))","v":0},0,{"$f":"IF(H31<>0,VLOOKUP(RIGHT(B31,5),Reference!$A$2:$H$196,3,FALSE),0)","v":0}]
[null,null,null,"Sub Total of Line 512",{"$f":"SUM(E28:E31)","v":0},{"$f":"SUM(F28:F31)","v":0},{"$f":"SUM(G28:G31)","v":0},{"$f":"SUM(H28:H31)","v":0},{"$f":"SUM(I28:I31)","v":0}]

{"sheet":"Page 7","index":6,"n_rows":32,"n_cols":9,"rows_kept":32,"cut":false,"hidden":false,"merged":[[17,0,21,0],[17,2,21,2],[22,0,26,0],[22,2,26,2],[27,0,31,0],[27,2,31,2],[7,0,11,0],[7,2,11,2],[2,0,5,0],[2,2,5,2],[12,0,16,0],[12,2,16,2]]}
["Industrial Property"]
["Line","DOR","NAICS","Primary Activity","LAND (FMV)","Improvements (FMV)","Personal Property (FMV)","Total Fair Market Value","TOTAL ASSESSED VALUE"]
[513,"30013","3311 \nthru\n3315","Industrial- Improved Land- Primary Metal Manufacturing",{"$f":"IF(ISERROR(VLOOKUP(B3,Reference!$A$2:$F$201,4,FALSE))=TRUE,0,VLOOKUP(RIGHT(B3,5),Reference!$A$2:$F$201,4,FALSE))","v":0},0,0,{"$f":"E3+F3+G3","v":0},{"$f":"IF(H3<>0,VLOOKUP(RIGHT(B3,5),Reference!$A$2:$H$196,3,FALSE),0)","v":0}]
[null,"30113",null,"Industrial- Manufacturing- Primary Metal Manufacturing",0,{"$f":"IF(ISERROR(VLOOKUP(B4,Reference!$A$2:$F$201,4,FALSE))=TRUE,0,VLOOKUP(RIGHT(B4,5),Reference!$A$2:$F$201,4,FALSE))","v":0},0,{"$f":"E4+F4+G4","v":0},{"$f":"IF(H4<>0,VLOOKUP(RIGHT(B4,5),Reference!$A$2:$H$196,3,FALSE),0)","v":0}]
[null,"30413",null,"Industrial- Support/Out Building Only- Primary Metal Manufacturing",0,{"$f":"IF(ISERROR(VLOOKUP(B5,Reference!$A$2:$F$201,4,FALSE))=TRUE,0,VLOOKUP(RIGHT(B5,5),Reference!$A$2:$F$201,4,FALSE))","v":0},0,0,{"$f":"IF(H5<>0,VLOOKUP(RIGHT(B5,5),Reference!$A$2:$H$196,3,FALSE),0)","v":0}]
[null,"39913",null,"Industrial- Personal Property- Primary Metal Manufacturing",0,0,{"$f":"IF(ISERROR(VLOOKUP(B6,Reference!$A$2:$F$201,4,FALSE))=TRUE,0,VLOOKUP(RIGHT(B6,5),Reference!$A$2:$F$201,4,FALSE))","v":0},{"$f":"E6+F6+G6","v":0},{"$f":"IF(H6<>0,VLOOKUP(RIGHT(B6,5),Reference!$A$2:$H$196,3,FALSE),0)","v":0}]
[null,null,null,"Sub Total of Line 513",{"$f":"SUM(E3:E6)","v":0},{"$f":"SUM(F3:F6)","v":0},{"$f":"SUM(G3:G6)","v":0},{"$f":"SUM(H3:H6)","v":0},{"$f":"SUM(I3:I6)","v":0}]
[514,"30014","3321\nthru\n3329 ","Industrial- Improved Land- Fabricated Metal ",{"$f":"IF(ISERROR(VLOOKUP(B8,Reference!$A$2:$F$201,4,FALSE))=TRUE,0,VLOOKUP(RIGHT(B8,5),Reference!$A$2:$F$201,4,FALSE))","v":0},0,0,0,{"$f":"IF(H8<>0,VLOOKUP(RIGHT(B8,5),Reference!$A$2:$H$196,3,FALSE),0)","v":0}]
[null,"30114",null,"Industrial- Manufacturing- Fabricated Metal ",0,{"$f":"IF(ISERROR(VLOOKUP(B9,Reference!$A$2:$F$201,4,FALSE))=TRUE,0,VLOOKUP(RIGHT(B9,5),Reference!$A$2:$F$201,4,FALSE))","v":0},0,0,{"$f":"IF(H9<>0,VLOOKUP(RIGHT(B9,5),Reference!$A$2:$H$196,3,FALSE),0)","v":0}]
[null,"30414",null,"Industrial- Support/Out Building Only- Fabricated Metal ",0,{"$f":"IF(ISERROR(VLOOKUP(B10,Reference!$A$2:$F$201,4,FALSE))=TRUE,0,VLOOKUP(RIGHT(B10,5),Reference!$A$2:$F$201,4,FALSE))","v":0},0,0,{"$f":"IF(H10<>0,VLOOKUP(RIGHT(B10,5),Reference!$A$2:$H$196,3,FALSE),0)","v":0}]
[null,"39914",null,"Industrial- Personal Property- Fabricated Metal ",0,0,{"$f":"IF(ISERROR(VLOOKUP(B11,Reference!$A$2:$F$201,4,FALSE))=TRUE,0,VLOOKUP(RIGHT(B11,5),Reference!$A$2:$F$201,4,FALSE))","v":0},{"$f":"E11+F11+G11","v":0},{"$f":"IF(H11<>0,VLOOKUP(RIGHT(B11,5),Reference!$A$2:$H$196,3,FALSE),0)","v":0}]
[null,null,null,"Sub Total of Line 514",{"$f":"SUM(E8:E11)","v":0},{"$f":"SUM(F8:F11)","v":0},{"$f":"SUM(G8:G11)","v":0},{"$f":"SUM(H8:H11)","v":0},{"$f":"SUM(I8:I11)","v":0}]
[515,"30015","3331\nthru\n3339 ","Industrial- Improved Land- Machinery Manufacturing",{"$f":"IF(ISERROR(VLOOKUP(B13,Reference!$A$2:$F$201,4,FALSE))=TRUE,0,VLOOKUP(RIGHT(B13,5),Reference!$A$2:$F$201,4,FALSE))","v":0},0,0,0,{"$f":"IF(H13<>0,VLOOKUP(RIGHT(B13,5),Reference!$A$2:$H$196,3,FALSE),0)","v":0}]
[null,"30115",null,"Industrial- Manufacturing- Machinery Manufacturing",0,{"$f":"IF(ISERROR(VLOOKUP(B14,Reference!$A$2:$F$201,4,FALSE))=TRUE,0,VLOOKUP(RIGHT(B14,5),Reference!$A$2:$F$201,4,FALSE))","v":0},0,0,{"$f":"IF(H14<>0,VLOOKUP(RIGHT(B14,5),Reference!$A$2:$H$196,3,FALSE),0)","v":0}]
[null,"30415",null,"Industrial- Support/Out Building Only- Machinery Manufacturing",0,{"$f":"IF(ISERROR(VLOOKUP(B15,Reference!$A$2:$F$201,4,FALSE))=TRUE,0,VLOOKUP(RIGHT(B15,5),Reference!$A$2:$F$201,4,FALSE))","v":0},0,0,{"$f":"IF(H15<>0,VLOOKUP(RIGHT(B15,5),Reference!$A$2:$H$196,3,FALSE),0)","v":0}]
[null,"39915",null,"Industrial- Personal Property- Machinery Manufacturing",0,0,{"$f":"IF(ISERROR(VLOOKUP(B16,Reference!$A$2:$F$201,4,FALSE))=TRUE,0,VLOOKUP(RIGHT(B16,5),Reference!$A$2:$F$201,4,FALSE))","v":0},{"$f":"E16+F16+G16","v":0},{"$f":"IF(H16<>0,VLOOKUP(RIGHT(B16,5),Reference!$A$2:$H$196,3,FALSE),0)","v":0}]
[null,null,null,"Sub Total of Line 515",{"$f":"SUM(E13:E16)","v":0},{"$f":"SUM(F13:F16)","v":0},{"$f":"SUM(G13:G16)","v":0},{"$f":"SUM(H13:H16)","v":0},{"$f":"SUM(I13:I16)","v":0}]
[516,"30016","3341\nthru\n3346 ","Industrial- Improved Land- Computer/Electronic Manufacturing",{"$f":"IF(ISERROR(VLOOKUP(B18,Reference!$A$2:$F$201,4,FALSE))=TRUE,0,VLOOKUP(RIGHT(B18,5),Reference!$A$2:$F$201,4,FALSE))","v":0},0,0,0,{"$f":"IF(H18<>0,VLOOKUP(RIGHT(B18,5),Reference!$A$2:$H$196,3,FALSE),0)","v":0}]
[null,"30116",null,"Industrial- Manufacturing- Computer/Electronic Manufacturing",0,{"$f":"IF(ISERROR(VLOOKUP(B19,Reference!$A$2:$F$201,4,FALSE))=TRUE,0,VLOOKUP(RIGHT(B19,5),Reference!$A$2:$F$201,4,FALSE))","v":0},0,0,{"$f":"IF(H19<>0,VLOOKUP(RIGHT(B19,5),Reference!$A$2:$H$196,3,FALSE),0)","v":0}]
[null,"30416",null,"Industrial- Support/Out Building Only- Computer/Electronic Manufacturing",0,{"$f":"IF(ISERROR(VLOOKUP(B20,Reference!$A$2:$F$201,4,FALSE))=TRUE,0,VLOOKUP(RIGHT(B20,5),Reference!$A$2:$F$201,4,FALSE))","v":0},0,0,{"$f":"IF(H20<>0,VLOOKUP(RIGHT(B20,5),Reference!$A$2:$H$196,3,FALSE),0)","v":0}]
[null,"39916",null,"Industrial- Personal Property- Computer/Electronic Manufacturing",0,0,{"$f":"IF(ISERROR(VLOOKUP(B21,Reference!$A$2:$F$201,4,FALSE))=TRUE,0,VLOOKUP(RIGHT(B21,5),Reference!$A$2:$F$201,4,FALSE))","v":0},{"$f":"E21+F21+G21","v":0},{"$f":"IF(H21<>0,VLOOKUP(RIGHT(B21,5),Reference!$A$2:$H$196,3,FALSE),0)","v":0}]
[null,null,null,"Sub Total of Line 516",{"$f":"SUM(E18:E21)","v":0},{"$f":"SUM(F18:F21)","v":0},{"$f":"SUM(G18:G21)","v":0},{"$f":"SUM(H18:H21)","v":0},{"$f":"SUM(I18:I21)","v":0}]
[517,"30017","3351\nthru\n3359","Industrial- Improved Land- Electrical/Appliance/Component Manufacturing",{"$f":"IF(ISERROR(VLOOKUP(B23,Reference!$A$2:$F$201,4,FALSE))=TRUE,0,VLOOKUP(RIGHT(B23,5),Reference!$A$2:$F$201,4,FALSE))","v":0},0,0,0,{"$f":"IF(H23<>0,VLOOKUP(RIGHT(B23,5),Reference!$A$2:$H$196,3,FALSE),0)","v":0}]
[null,"30117",null,"Industrial- Manufacturing- Electrical/Appliance/Component Manufacturing",0,{"$f":"IF(ISERROR(VLOOKUP(B24,Reference!$A$2:$F$201,4,FALSE))=TRUE,0,VLOOKUP(RIGHT(B24,5),Reference!$A$2:$F$201,4,FALSE))","v":0},0,0,{"$f":"IF(H24<>0,VLOOKUP(RIGHT(B24,5),Reference!$A$2:$H$196,3,FALSE),0)","v":0}]
[null,"30417",null,"Industrial- Support/Out Building Only- Electrical/Appliance/Component Manufacturing",0,{"$f":"IF(ISERROR(VLOOKUP(B25,Reference!$A$2:$F$201,4,FALSE))=TRUE,0,VLOOKUP(RIGHT(B25,5),Reference!$A$2:$F$201,4,FALSE))","v":0},0,0,{"$f":"IF(H25<>0,VLOOKUP(RIGHT(B25,5),Reference!$A$2:$H$196,3,FALSE),0)","v":0}]
[null,"39917",null,"Industrial- Personal Property- Electrical/Appliance/Component Manufacturing",0,0,{"$f":"IF(ISERROR(VLOOKUP(B26,Reference!$A$2:$F$201,4,FALSE))=TRUE,0,VLOOKUP(RIGHT(B26,5),Reference!$A$2:$F$201,4,FALSE))","v":0},{"$f":"E26+F26+G26","v":0},{"$f":"IF(H26<>0,VLOOKUP(RIGHT(B26,5),Reference!$A$2:$H$196,3,FALSE),0)","v":0}]
[null,null,null,"Sub Total of Line 517",{"$f":"SUM(E23:E26)","v":0},{"$f":"SUM(F23:F26)","v":0},{"$f":"SUM(G23:G26)","v":0},{"$f":"SUM(H23:H26)","v":0},{"$f":"SUM(I23:I26)","v":0}]
[518,"30018","3361\nthru\n3369","Industrial- Improved Land- Transportation Equipment",{"$f":"IF(ISERROR(VLOOKUP(B28,Reference!$A$2:$F$201,4,FALSE))=TRUE,0,VLOOKUP(RIGHT(B28,5),Reference!$A$2:$F$201,4,FALSE))","v":0},0,0,0,{"$f":"IF(H28<>0,VLOOKUP(RIGHT(B28,5),Reference!$A$2:$H$196,3,FALSE),0)","v":0}]
[null,"30118",null,"Industrial- Manufacturing- Transportation Equipment",0,{"$f":"IF(ISERROR(VLOOKUP(B29,Reference!$A$2:$F$201,4,FALSE))=TRUE,0,VLOOKUP(RIGHT(B29,5),Reference!$A$2:$F$201,4,FALSE))","v":0},0,0,{"$f":"IF(H29<>0,VLOOKUP(RIGHT(B29,5),Reference!$A$2:$H$196,3,FALSE),0)","v":0}]
[null,"30418",null,"Industrial- Support/Out Building Only- Transportation Equipment",0,{"$f":"IF(ISERROR(VLOOKUP(B30,Reference!$A$2:$F$201,4,FALSE))=TRUE,0,VLOOKUP(RIGHT(B30,5),Reference!$A$2:$F$201,4,FALSE))","v":0},0,0,{"$f":"IF(H30<>0,VLOOKUP(RIGHT(B30,5),Reference!$A$2:$H$196,3,FALSE),0)","v":0}]
[null,"39918",null,"Industrial- Personal Property- Transportation Equipment",0,0,{"$f":"IF(ISERROR(VLOOKUP(B31,Reference!$A$2:$F$201,4,FALSE))=TRUE,0,VLOOKUP(RIGHT(B31,5),Reference!$A$2:$F$201,4,FALSE))","v":0},{"$f":"E31+F31+G31","v":0},{"$f":"IF(H31<>0,VLOOKUP(RIGHT(B31,5),Reference!$A$2:$H$196,3,FALSE),0)","v":0}]
[null,null,null,"Sub Total of Line 518",{"$f":"SUM(E28:E31)","v":0},{"$f":"SUM(F28:F31)","v":0},{"$f":"SUM(G28:G31)","v":0},{"$f":"SUM(H28:H31)","v":0},{"$f":"SUM(I28:I31)","v":0}]

{"sheet":"Page 8","index":7,"n_rows":32,"n_cols":9,"rows_kept":32,"cut":false,"hidden":false,"merged":[[17,0,21,0],[17,2,21,2],[22,0,26,0],[22,2,26,2],[27,0,31,0],[27,2,31,2],[7,0,11,0],[7,2,11,2],[2,0,5,0],[2,2,5,2],[12,0,16,0],[12,2,16,2]]}
["Industrial Property"]
["Line","DOR","NAICS","Primary Activity","LAND (FMV)","Improvements (FMV)","Personal Property (FMV)","Total Fair Market Value","TOTAL ASSESSED VALUE"]
[519,"30019","3371 \nthru\n3379","Industrial- Improved Land- Furniture",{"$f":"IF(ISERROR(VLOOKUP(B3,Reference!$A$2:$F$201,4,FALSE))=TRUE,0,VLOOKUP(RIGHT(B3,5),Reference!$A$2:$F$201,4,FALSE))","v":0},0,0,{"$f":"E3+F3+G3","v":0},{"$f":"IF(H3<>0,VLOOKUP(RIGHT(B3,5),Reference!$A$2:$H$196,3,FALSE),0)","v":0}]
[null,"30119",null,"Industrial- Manufacturing- Furniture",0,{"$f":"IF(ISERROR(VLOOKUP(B4,Reference!$A$2:$F$201,4,FALSE))=TRUE,0,VLOOKUP(RIGHT(B4,5),Reference!$A$2:$F$201,4,FALSE))","v":0},0,{"$f":"E4+F4+G4","v":0},{"$f":"IF(H4<>0,VLOOKUP(RIGHT(B4,5),Reference!$A$2:$H$196,3,FALSE),0)","v":0}]
[null,"30419",null,"Industrial- Support/Out Building Only- Furniture",0,{"$f":"IF(ISERROR(VLOOKUP(B5,Reference!$A$2:$F$201,4,FALSE))=TRUE,0,VLOOKUP(RIGHT(B5,5),Reference!$A$2:$F$201,4,FALSE))","v":0},0,0,{"$f":"IF(H5<>0,VLOOKUP(RIGHT(B5,5),Reference!$A$2:$H$196,3,FALSE),0)","v":0}]
[null,"39919",null,"Industrial- Personal Property- Furniture",0,0,{"$f":"IF(ISERROR(VLOOKUP(B6,Reference!$A$2:$F$201,4,FALSE))=TRUE,0,VLOOKUP(RIGHT(B6,5),Reference!$A$2:$F$201,4,FALSE))","v":0},{"$f":"E6+F6+G6","v":0},{"$f":"IF(H6<>0,VLOOKUP(RIGHT(B6,5),Reference!$A$2:$H$196,3,FALSE),0)","v":0}]
[null,null,null,"Sub Total of Line 519",{"$f":"SUM(E3:E6)","v":0},{"$f":"SUM(F3:F6)","v":0},{"$f":"SUM(G3:G6)","v":0},{"$f":"SUM(H3:H6)","v":0},{"$f":"SUM(I3:I6)","v":0}]
[520,"30020",3391,"Industrial- Improved Land- Medical Equipment/Supplies",{"$f":"IF(ISERROR(VLOOKUP(B8,Reference!$A$2:$F$201,4,FALSE))=TRUE,0,VLOOKUP(RIGHT(B8,5),Reference!$A$2:$F$201,4,FALSE))","v":0},0,0,0,{"$f":"IF(H8<>0,VLOOKUP(RIGHT(B8,5),Reference!$A$2:$H$196,3,FALSE),0)","v":0}]
[null,"30120",null,"Industrial- Manufacturing- Medical Equipment/Supplies",0,{"$f":"IF(ISERROR(VLOOKUP(B9,Reference!$A$2:$F$201,4,FALSE))=TRUE,0,VLOOKUP(RIGHT(B9,5),Reference!$A$2:$F$201,4,FALSE))","v":0},0,0,{"$f":"IF(H9<>0,VLOOKUP(RIGHT(B9,5),Reference!$A$2:$H$196,3,FALSE),0)","v":0}]
[null,"30420",null,"Industrial- Support/Out Building Only- Medical Equipment/Supplies",0,{"$f":"IF(ISERROR(VLOOKUP(B10,Reference!$A$2:$F$201,4,FALSE))=TRUE,0,VLOOKUP(RIGHT(B10,5),Reference!$A$2:$F$201,4,FALSE))","v":0},0,0,{"$f":"IF(H10<>0,VLOOKUP(RIGHT(B10,5),Reference!$A$2:$H$196,3,FALSE),0)","v":0}]
[null,"39920",null,"Industrial- Personal Property- Medical Equipment/Supplies",0,0,{"$f":"IF(ISERROR(VLOOKUP(B11,Reference!$A$2:$F$201,4,FALSE))=TRUE,0,VLOOKUP(RIGHT(B11,5),Reference!$A$2:$F$201,4,FALSE))","v":0},{"$f":"E11+F11+G11","v":0},{"$f":"IF(H11<>0,VLOOKUP(RIGHT(B11,5),Reference!$A$2:$H$196,3,FALSE),0)","v":0}]
[null,null,null,"Sub Total of Line 520",{"$f":"SUM(E8:E11)","v":0},{"$f":"SUM(F8:F11)","v":0},{"$f":"SUM(G8:G11)","v":0},{"$f":"SUM(H8:H11)","v":0},{"$f":"SUM(I8:I11)","v":0}]
[521,"30021",3399,"Industrial- Improved Land- Jewelry/Silverware/Plate Ware",{"$f":"IF(ISERROR(VLOOKUP(B13,Reference!$A$2:$F$201,4,FALSE))=TRUE,0,VLOOKUP(RIGHT(B13,5),Reference!$A$2:$F$201,4,FALSE))","v":0},0,0,0,{"$f":"IF(H13<>0,VLOOKUP(RIGHT(B13,5),Reference!$A$2:$H$196,3,FALSE),0)","v":0}]
[null,"30121",null,"Industrial- Manufacturing- Jewelry/Silverware/Plate Ware",0,{"$f":"IF(ISERROR(VLOOKUP(B14,Reference!$A$2:$F$201,4,FALSE))=TRUE,0,VLOOKUP(RIGHT(B14,5),Reference!$A$2:$F$201,4,FALSE))","v":0},0,0,{"$f":"IF(H14<>0,VLOOKUP(RIGHT(B14,5),Reference!$A$2:$H$196,3,FALSE),0)","v":0}]
[null,"30421",null,"Industrial- Support/Out Building Only- Jewelry/Silverware/Plate Ware",0,{"$f":"IF(ISERROR(VLOOKUP(B15,Reference!$A$2:$F$201,4,FALSE))=TRUE,0,VLOOKUP(RIGHT(B15,5),Reference!$A$2:$F$201,4,FALSE))","v":0},0,0,{"$f":"IF(H15<>0,VLOOKUP(RIGHT(B15,5),Reference!$A$2:$H$196,3,FALSE),0)","v":0}]
[null,"39921",null,"Industrial- Personal Property- Jewelry/Silverware/Plate Ware",0,0,{"$f":"IF(ISERROR(VLOOKUP(B16,Reference!$A$2:$F$201,4,FALSE))=TRUE,0,VLOOKUP(RIGHT(B16,5),Reference!$A$2:$F$201,4,FALSE))","v":0},{"$f":"E16+F16+G16","v":0},{"$f":"IF(H16<>0,VLOOKUP(RIGHT(B16,5),Reference!$A$2:$H$196,3,FALSE),0)","v":0}]
[null,null,null,"Sub Total of Line 521",{"$f":"SUM(E13:E16)","v":0},{"$f":"SUM(F13:F16)","v":0},{"$f":"SUM(G13:G16)","v":0},{"$f":"SUM(H13:H16)","v":0},{"$f":"SUM(I13:I16)","v":0}]
[522,"30022",2111,"Industrial- Improved Land- Oil and Gas Extraction",{"$f":"IF(ISERROR(VLOOKUP(B18,Reference!$A$2:$F$201,4,FALSE))=TRUE,0,VLOOKUP(RIGHT(B18,5),Reference!$A$2:$F$201,4,FALSE))","v":0},0,0,0,{"$f":"IF(H18<>0,VLOOKUP(RIGHT(B18,5),Reference!$A$2:$H$196,3,FALSE),0)","v":0}]
[null,"30222",null,"Industrial- Mineral Co. Improvements- Oil and Gas Extraction",0,{"$f":"IF(ISERROR(VLOOKUP(B19,Reference!$A$2:$F$201,4,FALSE))=TRUE,0,VLOOKUP(RIGHT(B19,5),Reference!$A$2:$F$201,4,FALSE))","v":0},0,0,{"$f":"IF(H19<>0,VLOOKUP(RIGHT(B19,5),Reference!$A$2:$H$196,3,FALSE),0)","v":0}]
[null,"30422",null,"Industrial- Support/Out Building Only- Oil and Gas Extraction",0,{"$f":"IF(ISERROR(VLOOKUP(B20,Reference!$A$2:$F$201,4,FALSE))=TRUE,0,VLOOKUP(RIGHT(B20,5),Reference!$A$2:$F$201,4,FALSE))","v":0},0,0,{"$f":"IF(H20<>0,VLOOKUP(RIGHT(B20,5),Reference!$A$2:$H$196,3,FALSE),0)","v":0}]
[null,"39922",null,"Industrial- Personal Property- Oil and Gas Extraction",0,0,{"$f":"IF(ISERROR(VLOOKUP(B21,Reference!$A$2:$F$201,4,FALSE))=TRUE,0,VLOOKUP(RIGHT(B21,5),Reference!$A$2:$F$201,4,FALSE))","v":0},{"$f":"E21+F21+G21","v":0},{"$f":"IF(H21<>0,VLOOKUP(RIGHT(B21,5),Reference!$A$2:$H$196,3,FALSE),0)","v":0}]
[null,null,null,"Sub Total of Line 522",{"$f":"SUM(E18:E21)","v":0},{"$f":"SUM(F18:F21)","v":0},{"$f":"SUM(G18:G21)","v":0},{"$f":"SUM(H18:H21)","v":0},{"$f":"SUM(I18:I21)","v":0}]
[523,"30023",2121,"Industrial- Improved Land- Coal Mining",{"$f":"IF(ISERROR(VLOOKUP(B23,Reference!$A$2:$F$201,4,FALSE))=TRUE,0,VLOOKUP(RIGHT(B23,5),Reference!$A$2:$F$201,4,FALSE))","v":0},0,0,0,{"$f":"IF(H23<>0,VLOOKUP(RIGHT(B23,5),Reference!$A$2:$H$196,3,FALSE),0)","v":0}]
[null,"30223",null,"Industrial- Mineral Co. Improvements- Coal Mining",0,{"$f":"IF(ISERROR(VLOOKUP(B24,Reference!$A$2:$F$201,4,FALSE))=TRUE,0,VLOOKUP(RIGHT(B24,5),Reference!$A$2:$F$201,4,FALSE))","v":0},0,0,{"$f":"IF(H24<>0,VLOOKUP(RIGHT(B24,5),Reference!$A$2:$H$196,3,FALSE),0)","v":0}]
[null,"30423",null,"Industrial- Support/Out Building Only- Coal Mining",0,{"$f":"IF(ISERROR(VLOOKUP(B25,Reference!$A$2:$F$201,4,FALSE))=TRUE,0,VLOOKUP(RIGHT(B25,5),Reference!$A$2:$F$201,4,FALSE))","v":0},0,0,{"$f":"IF(H25<>0,VLOOKUP(RIGHT(B25,5),Reference!$A$2:$H$196,3,FALSE),0)","v":0}]
[null,"39923",null,"Industrial- Personal Property- Coal Mining",0,0,{"$f":"IF(ISERROR(VLOOKUP(B26,Reference!$A$2:$F$201,4,FALSE))=TRUE,0,VLOOKUP(RIGHT(B26,5),Reference!$A$2:$F$201,4,FALSE))","v":0},{"$f":"E26+F26+G26","v":0},{"$f":"IF(H26<>0,VLOOKUP(RIGHT(B26,5),Reference!$A$2:$H$196,3,FALSE),0)","v":0}]
[null,null,null,"Sub Total of Line 523",{"$f":"SUM(E23:E26)","v":0},{"$f":"SUM(F23:F26)","v":0},{"$f":"SUM(G23:G26)","v":0},{"$f":"SUM(H23:H26)","v":0},{"$f":"SUM(I23:I26)","v":0}]
[524,"30024",2122,"Industrial- Improved Land- Metal Ore Mining",{"$f":"IF(ISERROR(VLOOKUP(B28,Reference!$A$2:$F$201,4,FALSE))=TRUE,0,VLOOKUP(RIGHT(B28,5),Reference!$A$2:$F$201,4,FALSE))","v":0},0,0,0,{"$f":"IF(H28<>0,VLOOKUP(RIGHT(B28,5),Reference!$A$2:$H$196,3,FALSE),0)","v":0}]
[null,"30224",null,"Industrial- Mineral Co. Improvements- Metal Ore Mining",0,{"$f":"IF(ISERROR(VLOOKUP(B29,Reference!$A$2:$F$201,4,FALSE))=TRUE,0,VLOOKUP(RIGHT(B29,5),Reference!$A$2:$F$201,4,FALSE))","v":0},0,0,{"$f":"IF(H29<>0,VLOOKUP(RIGHT(B29,5),Reference!$A$2:$H$196,3,FALSE),0)","v":0}]
[null,"30424",null,"Industrial- Support/Out Building Only- Metal Ore Mining",0,{"$f":"IF(ISERROR(VLOOKUP(B30,Reference!$A$2:$F$201,4,FALSE))=TRUE,0,VLOOKUP(RIGHT(B30,5),Reference!$A$2:$F$201,4,FALSE))","v":0},0,0,{"$f":"IF(H30<>0,VLOOKUP(RIGHT(B30,5),Reference!$A$2:$H$196,3,FALSE),0)","v":0}]
[null,"39924",null,"Industrial- Personal Property- Metal Ore Mining",0,0,{"$f":"IF(ISERROR(VLOOKUP(B31,Reference!$A$2:$F$201,4,FALSE))=TRUE,0,VLOOKUP(RIGHT(B31,5),Reference!$A$2:$F$201,4,FALSE))","v":0},{"$f":"E31+F31+G31","v":0},{"$f":"IF(H31<>0,VLOOKUP(RIGHT(B31,5),Reference!$A$2:$H$196,3,FALSE),0)","v":0}]
[null,null,null,"Sub Total of Line 524",{"$f":"SUM(E28:E31)","v":0},{"$f":"SUM(F28:F31)","v":0},{"$f":"SUM(G28:G31)","v":0},{"$f":"SUM(H28:H31)","v":0},{"$f":"SUM(I28:I31)","v":0}]

{"sheet":"Page 9","index":8,"n_rows":30,"n_cols":9,"rows_kept":30,"cut":false,"hidden":false,"merged":[[2,0,6,0],[2,2,6,2],[7,0,11,0],[7,2,11,2],[29,0,29,3],[12,0,16,0],[12,2,16,2],[17,0,21,0],[17,2,21,2],[27,0,28,0],[27,2,28,2],[22,0,26,0],[22,2,26,2]]}
["Industrial Property"]
["Line","DOR","NAICS","Primary Activity","LAND (FMV)","Improvements (FMV)","Personal Property (FMV)","Total Fair Market Value","TOTAL ASSESSED VALUE"]
[525,"30025",2123,"Industrial- Improved Land- Non-Metal Mining",{"$f":"IF(ISERROR(VLOOKUP(B3,Reference!$A$2:$F$201,4,FALSE))=TRUE,0,VLOOKUP(RIGHT(B3,5),Reference!$A$2:$F$201,4,FALSE))","v":0},0,0,{"$f":"E3+F3+G3","v":0},{"$f":"IF(H3<>0,VLOOKUP(RIGHT(B3,5),Reference!$A$2:$H$196,3,FALSE),0)","v":0}]
[null,"30225",null,"Industrial- Mineral Co. Improvements- Non-Metal Mining",0,{"$f":"IF(ISERROR(VLOOKUP(B4,Reference!$A$2:$F$201,4,FALSE))=TRUE,0,VLOOKUP(RIGHT(B4,5),Reference!$A$2:$F$201,4,FALSE))","v":0},0,{"$f":"E4+F4+G4","v":0},{"$f":"IF(H4<>0,VLOOKUP(RIGHT(B4,5),Reference!$A$2:$H$196,3,FALSE),0)","v":0}]
[null,"30425",null,"Industrial- Support/Out Building Only- Non-Metal Mining",0,{"$f":"IF(ISERROR(VLOOKUP(B5,Reference!$A$2:$F$201,4,FALSE))=TRUE,0,VLOOKUP(RIGHT(B5,5),Reference!$A$2:$F$201,4,FALSE))","v":0},0,0,{"$f":"IF(H5<>0,VLOOKUP(RIGHT(B5,5),Reference!$A$2:$H$196,3,FALSE),0)","v":0}]
[null,"39925",null,"Industrial- Personal Property- Non-Metal Mining",0,0,{"$f":"IF(ISERROR(VLOOKUP(B6,Reference!$A$2:$F$201,4,FALSE))=TRUE,0,VLOOKUP(RIGHT(B6,5),Reference!$A$2:$F$201,4,FALSE))","v":0},{"$f":"E6+F6+G6","v":0},{"$f":"IF(H6<>0,VLOOKUP(RIGHT(B6,5),Reference!$A$2:$H$196,3,FALSE),0)","v":0}]
[null,null,null,"Sub Total of Line 525",{"$f":"SUM(E3:E6)","v":0},{"$f":"SUM(F3:F6)","v":0},{"$f":"SUM(G3:G6)","v":0},{"$f":"SUM(H3:H6)","v":0},{"$f":"SUM(I3:I6)","v":0}]
[526,"30026",3241,"Industrial- Improved Land- Petroleum & Coal Product Manufacturing",{"$f":"IF(ISERROR(VLOOKUP(B8,Reference!$A$2:$F$201,4,FALSE))=TRUE,0,VLOOKUP(RIGHT(B8,5),Reference!$A$2:$F$201,4,FALSE))","v":0},0,0,0,{"$f":"IF(H8<>0,VLOOKUP(RIGHT(B8,5),Reference!$A$2:$H$196,3,FALSE),0)","v":0}]
[null,"30126",null,"Industrial- Mineral Co. Improvements- Petroleum & Coal Product Manufacturing",0,{"$f":"IF(ISERROR(VLOOKUP(B9,Reference!$A$2:$F$201,4,FALSE))=TRUE,0,VLOOKUP(RIGHT(B9,5),Reference!$A$2:$F$201,4,FALSE))","v":0},0,0,{"$f":"IF(H9<>0,VLOOKUP(RIGHT(B9,5),Reference!$A$2:$H$196,3,FALSE),0)","v":0}]
[null,"30426",null,"Industrial- Support/Out Building Only- Petroleum & Coal Product Manufacturing",0,{"$f":"IF(ISERROR(VLOOKUP(B10,Reference!$A$2:$F$201,4,FALSE))=TRUE,0,VLOOKUP(RIGHT(B10,5),Reference!$A$2:$F$201,4,FALSE))","v":0},0,0,{"$f":"IF(H10<>0,VLOOKUP(RIGHT(B10,5),Reference!$A$2:$H$196,3,FALSE),0)","v":0}]
[null,"39926",null,"Industrial- Personal Property- Petroleum & Coal Product Manufacturing",0,0,{"$f":"IF(ISERROR(VLOOKUP(B11,Reference!$A$2:$F$201,4,FALSE))=TRUE,0,VLOOKUP(RIGHT(B11,5),Reference!$A$2:$F$201,4,FALSE))","v":0},{"$f":"E11+F11+G11","v":0},{"$f":"IF(H11<>0,VLOOKUP(RIGHT(B11,5),Reference!$A$2:$H$196,3,FALSE),0)","v":0}]
[null,null,null,"Sub Total of Line 526",{"$f":"SUM(E8:E11)","v":0},{"$f":"SUM(F8:F11)","v":0},{"$f":"SUM(G8:G11)","v":0},{"$f":"SUM(H8:H11)","v":0},{"$f":"SUM(I8:I11)","v":0}]
[527,"30027",3251,"Industrial- Improved Land- Basic Chemical Manufacturing",{"$f":"IF(ISERROR(VLOOKUP(B13,Reference!$A$2:$F$201,4,FALSE))=TRUE,0,VLOOKUP(RIGHT(B13,5),Reference!$A$2:$F$201,4,FALSE))","v":0},0,0,0,{"$f":"IF(H13<>0,VLOOKUP(RIGHT(B13,5),Reference!$A$2:$H$196,3,FALSE),0)","v":0}]
[null,"30127",null,"Industrial- Mineral Co. Improvements- Basic Chemical Manufacturing",0,{"$f":"IF(ISERROR(VLOOKUP(B14,Reference!$A$2:$F$201,4,FALSE))=TRUE,0,VLOOKUP(RIGHT(B14,5),Reference!$A$2:$F$201,4,FALSE))","v":0},0,0,{"$f":"IF(H14<>0,VLOOKUP(RIGHT(B14,5),Reference!$A$2:$H$196,3,FALSE),0)","v":0}]
[null,"30427",null,"Industrial- Support/Out Building Only- Basic Chemical Manufacturing",0,{"$f":"IF(ISERROR(VLOOKUP(B15,Reference!$A$2:$F$201,4,FALSE))=TRUE,0,VLOOKUP(RIGHT(B15,5),Reference!$A$2:$F$201,4,FALSE))","v":0},0,0,{"$f":"IF(H15<>0,VLOOKUP(RIGHT(B15,5),Reference!$A$2:$H$196,3,FALSE),0)","v":0}]
[null,"39927",null,"Industrial- Personal Property- Basic Chemical Manufacturing",0,0,{"$f":"IF(ISERROR(VLOOKUP(B16,Reference!$A$2:$F$201,4,FALSE))=TRUE,0,VLOOKUP(RIGHT(B16,5),Reference!$A$2:$F$201,4,FALSE))","v":0},{"$f":"E16+F16+G16","v":0},{"$f":"IF(H16<>0,VLOOKUP(RIGHT(B16,5),Reference!$A$2:$H$196,3,FALSE),0)","v":0}]
[null,null,null,"Sub Total of Line 527",{"$f":"SUM(E13:E16)","v":0},{"$f":"SUM(F13:F16)","v":0},{"$f":"SUM(G13:G16)","v":0},{"$f":"SUM(H13:H16)","v":0},{"$f":"SUM(I13:I16)","v":0}]
[528,"30028","4861\nthru\n4869","Industrial- Improved Land- Pipeline Transportation",{"$f":"IF(ISERROR(VLOOKUP(B18,Reference!$A$2:$F$201,4,FALSE))=TRUE,0,VLOOKUP(RIGHT(B18,5),Reference!$A$2:$F$201,4,FALSE))","v":0},0,0,0,{"$f":"IF(H18<>0,VLOOKUP(RIGHT(B18,5),Reference!$A$2:$H$196,3,FALSE),0)","v":0}]
[null,"30329",null,"Industrial- Mineral Co. Improvements- Pipeline Transportation",0,{"$f":"IF(ISERROR(VLOOKUP(B19,Reference!$A$2:$F$201,4,FALSE))=TRUE,0,VLOOKUP(RIGHT(B19,5),Reference!$A$2:$F$201,4,FALSE))","v":0},0,0,{"$f":"IF(H19<>0,VLOOKUP(RIGHT(B19,5),Reference!$A$2:$H$196,3,FALSE),0)","v":0}]
[null,"30428",null,"Industrial- Support/Out Building Only- Pipeline Transportation",0,{"$f":"IF(ISERROR(VLOOKUP(B20,Reference!$A$2:$F$201,4,FALSE))=TRUE,0,VLOOKUP(RIGHT(B20,5),Reference!$A$2:$F$201,4,FALSE))","v":0},0,0,{"$f":"IF(H20<>0,VLOOKUP(RIGHT(B20,5),Reference!$A$2:$H$196,3,FALSE),0)","v":0}]
[null,"39928",null,"Industrial- Personal Property- Pipeline Transportation",0,0,{"$f":"IF(ISERROR(VLOOKUP(B21,Reference!$A$2:$F$201,4,FALSE))=TRUE,0,VLOOKUP(RIGHT(B21,5),Reference!$A$2:$F$201,4,FALSE))","v":0},{"$f":"E21+F21+G21","v":0},{"$f":"IF(H21<>0,VLOOKUP(RIGHT(B21,5),Reference!$A$2:$H$196,3,FALSE),0)","v":0}]
[null,null,null,"Sub Total of Line 528",{"$f":"SUM(E18:E21)","v":0},{"$f":"SUM(F18:F21)","v":0},{"$f":"SUM(G18:G21)","v":0},{"$f":"SUM(H18:H21)","v":0},{"$f":"SUM(I18:I21)","v":0}]
[529,"30029",2211,"Industrial- Improved Land- Electrical Power Generation",{"$f":"IF(ISERROR(VLOOKUP(B23,Reference!$A$2:$F$201,4,FALSE))=TRUE,0,VLOOKUP(RIGHT(B23,5),Reference!$A$2:$F$201,4,FALSE))","v":0},0,0,{"$f":"E23+F23+G23","v":0},{"$f":"IF(H23<>0,VLOOKUP(RIGHT(B23,5),Reference!$A$2:$H$196,3,FALSE),0)","v":0}]
[null,"30129",null,"Industrial- Mineral Co. Improvements- Electrical Power Generation",0,{"$f":"IF(ISERROR(VLOOKUP(B24,Reference!$A$2:$F$201,4,FALSE))=TRUE,0,VLOOKUP(RIGHT(B24,5),Reference!$A$2:$F$201,4,FALSE))","v":0},0,0,{"$f":"IF(H24<>0,VLOOKUP(RIGHT(B24,5),Reference!$A$2:$H$196,3,FALSE),0)","v":0}]
[null,"30429",null,"Industrial- Support/Out Building Only- Electrical Power Generation",0,{"$f":"IF(ISERROR(VLOOKUP(B25,Reference!$A$2:$F$201,4,FALSE))=TRUE,0,VLOOKUP(RIGHT(B25,5),Reference!$A$2:$F$201,4,FALSE))","v":0},0,0,{"$f":"IF(H25<>0,VLOOKUP(RIGHT(B25,5),Reference!$A$2:$H$196,3,FALSE),0)","v":0}]
[null,"39929",null,"Industrial- Personal Property- Electrical Power Generation",0,0,{"$f":"IF(ISERROR(VLOOKUP(B26,Reference!$A$2:$F$201,4,FALSE))=TRUE,0,VLOOKUP(RIGHT(B26,5),Reference!$A$2:$F$201,4,FALSE))","v":0},{"$f":"E26+F26+G26","v":0},{"$f":"IF(H26<>0,VLOOKUP(RIGHT(B26,5),Reference!$A$2:$H$196,3,FALSE),0)","v":0}]
[null,null,null,"Sub Total of Line 529",{"$f":"SUM(E23:E26)","v":0},{"$f":"SUM(F23:F26)","v":0},{"$f":"SUM(G23:G26)","v":0},{"$f":"SUM(H23:H26)","v":0},{"$f":"SUM(I23:I26)","v":0}]
[531,"00300",null,"Vacant Industrial Land",{"$f":"IF(ISERROR(VLOOKUP(B28,Reference!$A$2:$F$201,4,FALSE))=TRUE,0,VLOOKUP(RIGHT(B28,5),Reference!$A$2:$F$201,4,FALSE))","v":0},0,0,0,{"$f":"IF(H28<>0,VLOOKUP(RIGHT(B28,5),Reference!$A$2:$H$196,3,FALSE),0)","v":0}]
[null,null,null,"Sub Total of Line 531",{"$f":"SUM(E28)","v":0},{"$f":"SUM(F28)","v":0},{"$f":"SUM(G28)","v":0},{"$f":"SUM(H28)","v":0},{"$f":"SUM(I28)","v":0}]
["D \"Total Industrial Property\"",null,null,null,{"$f":"'Page 5'!E7+'Page 5'!E12+'Page 5'!E17+'Page 5'!E22+'Page 5'!E27+'Page 5'!E32+'Page 6'!E7+'Page 6'!E12+'Page 6'!E17+'Page 6'!E22+'Page 6'!E27+'Page 6'!E32+'Page 7'!E7+'Page 7'!E12+'Page 7'!E17+'Page 7'!E22+'Page 7'!E27+'Page 7'!E32+'Page 8'!E7+'Page 8'!E12+'Page 8'!E17+'Page 8'!E22+'Page 8'!E27+'Page 8'!E32+'Page 9'!E7+'Page 9'!E12+'Page 9'!E17+'Page 9'!E22+E27+'Page 9'!E29","v":0},{"$f":"'Page 5'!F7+'Page 5'!F12+'Page 5'!F17+'Page 5'!F22+'Page 5'!F27+'Page 5'!F32+'Page 6'!F7+'Page 6'!F12+'Page 6'!F17+'Page 6'!F22+'Page 6'!F27+'Page 6'!F32+'Page 7'!F7+'Page 7'!F12+'Page 7'!F17+'Page 7'!F22+'Page 7'!F27+'Page 7'!F32+'Page 8'!F7+'Page 8'!F12+'Page 8'!F17+'Page 8'!F22+'Page 8'!F27+'Page 8'!F32+'Page 9'!F7+'Page 9'!F12+'Page 9'!F17+'Page 9'!F22+F27+'Page 9'!F29","v":0},{"$f":"'Page 5'!G7+'Page 5'!G12+'Page 5'!G17+'Page 5'!G22+'Page 5'!G27+'Page 5'!G32+'Page 6'!G7+'Page 6'!G12+'Page 6'!G17+'Page 6'!G22+'Page 6'!G27+'Page 6'!G32+'Page 7'!G7+'Page 7'!G12+'Page 7'!G17+'Page 7'!G22+'Page 7'!G27+'Page 7'!G32+'Page 8'!G7+'Page 8'!G12+'Page 8'!G17+'Page 8'!G22+'Page 8'!G27+'Page 8'!G32+'Page 9'!G7+'Page 9'!G12+'Page 9'!G17+'Page 9'!G22+G27+'Page 9'!G29","v":0},{"$f":"'Page 5'!H7+'Page 5'!H12+'Page 5'!H17+'Page 5'!H22+'Page 5'!H27+'Page 5'!H32+'Page 6'!H7+'Page 6'!H12+'Page 6'!H17+'Page 6'!H22+'Page 6'!H27+'Page 6'!H32+'Page 7'!H7+'Page 7'!H12+'Page 7'!H17+'Page 7'!H22+'Page 7'!H27+'Page 7'!H32+'Page 8'!H7+'Page 8'!H12+'Page 8'!H17+'Page 8'!H22+'Page 8'!H27+'Page 8'!H32+'Page 9'!H7+'Page 9'!H12+'Page 9'!H17+'Page 9'!H22+H27+'Page 9'!H29","v":0},{"$f":"'Page 5'!I7+'Page 5'!I12+'Page 5'!I17+'Page 5'!I22+'Page 5'!I27+'Page 5'!I32+'Page 6'!I7+'Page 6'!I12+'Page 6'!I17+'Page 6'!I22+'Page 6'!I27+'Page 6'!I32+'Page 7'!I7+'Page 7'!I12+'Page 7'!I17+'Page 7'!I22+'Page 7'!I27+'Page 7'!I32+'Page 8'!I7+'Page 8'!I12+'Page 8'!I17+'Page 8'!I22+'Page 8'!I27+'Page 8'!I32+'Page 9'!I7+'Page 9'!I12+'Page 9'!I17+'Page 9'!I22+I27+'Page 9'!I29","v":0}]

{"sheet":"Page 10","index":9,"n_rows":35,"n_cols":5,"rows_kept":35,"cut":false,"hidden":false,"merged":[]}
["Pollution Control Exemptions Granted 2024"]
["Abstract Line","Classification","FMV of Exemption Requested","FMV of Exemption Granted","Assessed Value"]
[]
[]
[]
[]
[]
[]
[]
[]
[]
[]
[]
[]
[]
[]
[]
[]
[]
[]
[]
[]
[]
[]
[]
[]
[]
[]
[]
[]
[]
[]
[]
[]
["Totals",null,{"$f":"SUM(C3:C34)","v":0},{"$f":"SUM(D3:D34)","v":0},{"$f":"SUM(E3:E34)","v":0}]

{"sheet":"Page 11","index":10,"n_rows":35,"n_cols":5,"rows_kept":35,"cut":false,"hidden":false,"merged":[]}
["Fire Control Exemptions Granted 2024"]
["Abstract Line","Classification","FMV of Exemption Requested","FMV of Exemption Granted","Assessed Value"]
[]
[]
[]
[]
[]
[]
[]
[]
[]
[]
[]
[]
[]
[]
[]
[]
[]
[]
[]
[]
[]
[]
[]
[]
[]
[]
[]
[]
[]
[]
[]
[]
["Totals",null,{"$f":"SUM(C3:C34)","v":0},{"$f":"SUM(D3:D34)","v":0},{"$f":"SUM(E3:E34)","v":0}]

{"sheet":"Page 12","index":11,"n_rows":35,"n_cols":6,"rows_kept":35,"cut":false,"hidden":false,"merged":[]}
["Vacant Land Valuation - Wyo. Stat. Ann. 39-13-103(b)(xvii)"]
["Abstract Line","Classification","FMV not using present worth methodology","Assessed Value","FMV using present worth methodology","Assessed Value"]
[null,"Example: North Hills, 5 lots"]
[]
[]
[]
[]
[]
[]
[]
[]
[]
[]
[]
[]
[]
[]
[]
[]
[]
[]
[]
[]
[]
[]
[]
[]
[]
[]
[]
[]
[]
[]
[]
["Totals",null,{"$f":"SUM(C3:C34)","v":0},{"$f":"SUM(D3:D34)","v":0},{"$f":"SUM(E3:E34)","v":0},{"$f":"SUM(F3:F34)","v":0}]

{"sheet":"Page 13","index":12,"n_rows":35,"n_cols":6,"rows_kept":35,"cut":false,"hidden":false,"merged":[]}
["Exemption for Economic Development Property- Wyo. Stat. ann. 39-11-105(a)(xxxvii) - Effective January 1, 2011"]
["Abstract Line","Classification","FMV Without Exemption ","Assessed Value","FMV With Exemption","Assessed Value"]
[]
[]
[]
[]
[]
[]
[]
[]
[]
[]
[]
[]
[]
[]
[]
[]
[]
[]
[]
[]
[]
[]
[]
[]
[]
[]
[]
[]
[]
[]
[]
[]
["Totals",null,{"$f":"SUM(C3:C34)","v":0},{"$f":"SUM(D3:D34)","v":0},{"$f":"SUM(E3:E34)","v":0},{"$f":"SUM(F3:F34)","v":0}]

{"sheet":"Page 14","index":13,"n_rows":15,"n_cols":4,"rows_kept":15,"cut":false,"hidden":false,"merged":[]}
["Properties Held by County Under Tax Purchase"]
["Line","Classification","Fair Market Value","Assessed Value"]
[100,"Irrigated Lands",null,{"$f":"C3*0.095","v":0}]
[200,"Dry Crop Lands ",null,{"$f":"C4*0.095","v":0}]
[300,"Range Lands",null,0]
[301,"Residential Lands",null,0]
[302,"Residential Improvements",null,0]
[303,"Commercial Lands",null,0]
[304,"Commercial Improvements",null,0]
[401,"Residential Personal Property",null,0]
[402,"Commercial Personal Property",null,0]
["500-A","Industrial Land",null,{"$f":"C12*0.115","v":0}]
["500-B","Industrial Improvements",null,{"$f":"C13*0.115","v":0}]
["500-C","Industrial Personal Property",null,{"$f":"C14*0.115","v":0}]
["TOTAL PROPERTIES HELD UNDER TAX PURCHASE",null,{"$f":"SUM(C3:C14)","v":0},{"$f":"SUM(D3:D14)","v":0}]

{"sheet":"Page 15","index":14,"n_rows":12,"n_cols":6,"rows_kept":12,"cut":false,"hidden":false,"merged":[[0,0,0,4],[1,0,1,4]]}
["4% Taxable Value Increase Cap Exemptions",null,null,null,null,"1. Run the SBOE Residential Exemption query in Listbuilder"]
[" Wyo. Stat. Ann. 39-13-103(b)(xvii)",null,null,null,null,"2. Export the results into Excel."]
["Abstract Code","Fair Market Value","Total FMV Exemptions","Assessed Value","Total AV Exemptions","3. Highlight only the cells with data, copy, and paste here.                        -->"]
[{"$f":"M4","v":0},{"$f":"G4","v":0},{"$f":"I4","v":0},{"$f":"J4","v":0},{"$f":"L4","v":0}]
[{"$f":"M5","v":0},{"$f":"G5","v":0},{"$f":"I5","v":0},{"$f":"J5","v":0},{"$f":"L5","v":0}]
[0,0,0,0,0]
[0,0,0,0,0]
[0,0,0,0,0]
[0,0,0,0,0]
[0,0,0,0,0]
[0,0,0,0,0]
[0,0,0,0,0]

{"sheet":"Test","index":15,"n_rows":200,"n_cols":8,"rows_kept":200,"cut":false,"hidden":false,"merged":[]}
["STATEEQUIVABSTCODE","CountOfACCOUNTNO","SumOfRAWASSDVAL","SumOfACTVAL","SumOfACRES","SumOfSQFT","CLASSIFICATIONID","SORTORDER"]
["00101",{"$f":"VALUE(A2)","v":101},{"$f":"B2","v":101},101,101,101,null,{"$f":"LEFT(A2,1)","v":"0"}]
["00102",102,102,102,102,102,null,"0"]
["00103",103,103,103,103,103,null,"0"]
["00400",400,400,400,400,400,null,"0"]
["00200",200,200,200,200,200,null,"0"]
["00300",300,300,300,300,300,null,"0"]
["10001",10001,10001,10001,10001,10001,null,"1"]
["10002",10002,10002,10002,10002,10002,null,"1"]
["10003",10003,10003,10003,10003,10003,null,"1"]
["10004",10004,10004,10004,10004,10004,null,"1"]
["10005",10005,10005,10005,10005,10005,null,"1"]
["10101",10101,10101,10101,10101,10101,null,"1"]
["10102",10102,10102,10102,10102,10102,null,"1"]
["10200",10200,10200,10200,10200,10200,null,"1"]
["10401",10401,10401,10401,10401,10401,null,"1"]
["10402",10402,10402,10402,10402,10402,null,"1"]
["10500",10500,10500,10500,10500,10500,null,"1"]
["10600",10600,10600,10600,10600,10600,null,"1"]
["10103",10103,10103,10103,10103,10103,null,"1"]
["10403",10403,10403,10403,10403,10403,null,"1"]
["20000",20000,{"$f":"B22","v":20000},20000,20000,20000,null,"2"]
["20100",20100,20100,20100,20100,20100,null,"2"]
["20200",20200,20200,20200,20200,20200,null,"2"]
["20300",20300,20300,20300,20300,20300,null,"2"]
["20400",20400,20400,20400,20400,20400,null,"2"]
["20500",20500,20500,20500,20500,20500,null,"2"]
["20600",20600,20600,20600,20600,20600,null,"2"]
["20701",20701,20701,20701,20701,20701,null,"2"]
["20702",20702,20702,20702,20702,20702,null,"2"]
["20703",20703,20703,20703,20703,20703,null,"2"]
["20800",20800,20800,20800,20800,20800,null,"2"]
["20900",20900,20900,20900,20900,20900,null,"2"]
["21000",21000,21000,21000,21000,21000,null,"2"]
["21100",21100,21100,21100,21100,21100,null,"2"]
["21201",21201,21201,21201,21201,21201,null,"2"]
["21301",21301,21301,21301,21301,21301,null,"2"]
["21302",21302,21302,21302,21302,21302,null,"2"]
["21303",21303,21303,21303,21303,21303,null,"2"]
["21304",21304,21304,21304,21304,21304,null,"2"]
["29900",29900,29900,29900,29900,29900,null,"2"]
["30001",30001,{"$f":"B42","v":30001},30001,30001,30001,null,"3"]
["30101",30101,30101,30101,30101,30101,null,"3"]
["30401",30401,30401,30401,30401,30401,null,"3"]
["39901",39901,39901,39901,39901,39901,null,"3"]
["30002",30002,30002,30002,30002,30002,null,"3"]
["30102",30102,30102,30102,30102,30102,null,"3"]
["30402",30402,30402,30402,30402,30402,null,"3"]
["39902",39902,39902,39902,39902,39902,null,"3"]
["30003",30003,30003,30003,30003,30003,null,"3"]
["30103",30103,30103,30103,30103,30103,null,"3"]
["30403",30403,30403,30403,30403,30403,null,"3"]
["39903",39903,39903,39903,39903,39903,null,"3"]
["30004",30004,30004,30004,30004,30004,null,"3"]
["30104",30104,30104,30104,30104,30104,null,"3"]
["30404",30404,30404,30404,30404,30404,null,"3"]
["39904",39904,39904,39904,39904,39904,null,"3"]
["30005",30005,30005,30005,30005,30005,null,"3"]
["30105",30105,30105,30105,30105,30105,null,"3"]
["30405",30405,30405,30405,30405,30405,null,"3"]
["39905",39905,39905,39905,39905,39905,null,"3"]
["30006",30006,{"$f":"B62","v":30006},30006,30006,30006,null,"3"]
["30106",30106,30106,30106,30106,30106,null,"3"]
["30406",30406,30406,30406,30406,30406,null,"3"]
["39906",39906,39906,39906,39906,39906,null,"3"]
["30007",{"$f":"VALUE(A66)","v":30007},30007,30007,30007,30007,null,{"$f":"LEFT(A66,1)","v":"3"}]
["30107",30107,30107,30107,30107,30107,null,"3"]
["30407",30407,30407,30407,30407,30407,null,"3"]
["39907",39907,39907,39907,39907,39907,null,"3"]
["30008",30008,30008,30008,30008,30008,null,"3"]
["30108",30108,30108,30108,30108,30108,null,"3"]
["30408",30408,30408,30408,30408,30408,null,"3"]
["39908",39908,39908,39908,39908,39908,null,"3"]
["30009",30009,30009,30009,30009,30009,null,"3"]
["30109",30109,30109,30109,30109,30109,null,"3"]
["30409",30409,30409,30409,30409,30409,null,"3"]
["39909",39909,39909,39909,39909,39909,null,"3"]
["30010",30010,30010,30010,30010,30010,null,"3"]
["30110",30110,30110,30110,30110,30110,null,"3"]
["30410",30410,30410,30410,30410,30410,null,"3"]
["39910",39910,39910,39910,39910,39910,null,"3"]
["30011",30011,{"$f":"B82","v":30011},30011,30011,30011,null,"3"]
["30111",30111,30111,30111,30111,30111,null,"3"]
["30411",30411,30411,30411,30411,30411,null,"3"]
["39911",39911,39911,39911,39911,39911,null,"3"]
["30012",30012,30012,30012,30012,30012,null,"3"]
["30112",30112,30112,30112,30112,30112,null,"3"]
["30412",30412,30412,30412,30412,30412,null,"3"]
["39912",39912,39912,39912,39912,39912,null,"3"]
["30013",30013,30013,30013,30013,30013,null,"3"]
["30113",30113,30113,30113,30113,30113,null,"3"]
["30413",30413,30413,30413,30413,30413,null,"3"]
["39913",39913,39913,39913,39913,39913,null,"3"]
["30014",30014,30014,30014,30014,30014,null,"3"]
["30114",30114,30114,30114,30114,30114,null,"3"]
["30414",30414,30414,30414,30414,30414,null,"3"]
["39914",39914,39914,39914,39914,39914,null,"3"]
["30015",30015,30015,30015,30015,30015,null,"3"]
["30115",30115,30115,30115,30115,30115,null,"3"]
["30415",30415,30415,30415,30415,30415,null,"3"]
["39915",39915,39915,39915,39915,39915,null,"3"]
["30016",30016,{"$f":"B102","v":30016},30016,30016,30016,null,"3"]
["30116",30116,30116,30116,30116,30116,null,"3"]
["30416",30416,30416,30416,30416,30416,null,"3"]
["39916",39916,39916,39916,39916,39916,null,"3"]
["30017",30017,30017,30017,30017,30017,null,"3"]
["30117",30117,30117,30117,30117,30117,null,"3"]
["30417",30417,30417,30417,30417,30417,null,"3"]
["39917",39917,39917,39917,39917,39917,null,"3"]
["30018",30018,30018,30018,30018,30018,null,"3"]
["30118",30118,30118,30118,30118,30118,null,"3"]
["30418",30418,30418,30418,30418,30418,null,"3"]
["39918",39918,39918,39918,39918,39918,null,"3"]
["30019",30019,30019,30019,30019,30019,null,"3"]
["30119",30119,30119,30119,30119,30119,null,"3"]
["30419",30419,30419,30419,30419,30419,null,"3"]
["39919",39919,39919,39919,39919,39919,null,"3"]
["30020",30020,30020,30020,30020,30020,null,"3"]
["30120",30120,30120,30120,30120,30120,null,"3"]
["30420",30420,30420,30420,30420,30420,null,"3"]
["39920",39920,39920,39920,39920,39920,null,"3"]
["30021",30021,{"$f":"B122","v":30021},30021,30021,30021,null,"3"]
["30121",30121,30121,30121,30121,30121,null,"3"]
["30421",30421,30421,30421,30421,30421,null,"3"]
["39921",39921,39921,39921,39921,39921,null,"3"]
["30022",30022,30022,30022,30022,30022,null,"3"]
["30222",30222,30222,30222,30222,30222,null,"3"]
["30422",30422,30422,30422,30422,30422,null,"3"]
["39922",39922,39922,39922,39922,39922,null,"3"]
["30023",{"$f":"VALUE(A130)","v":30023},30023,30023,30023,30023,null,{"$f":"LEFT(A130,1)","v":"3"}]
["30223",30223,30223,30223,30223,30223,null,"3"]
["30423",30423,30423,30423,30423,30423,null,"3"]
["39923",39923,39923,39923,39923,39923,null,"3"]
["30024",30024,30024,30024,30024,30024,null,"3"]
["30224",30224,30224,30224,30224,30224,null,"3"]
["30424",30424,30424,30424,30424,30424,null,"3"]
["39924",39924,39924,39924,39924,39924,null,"3"]
["30025",30025,30025,30025,30025,30025,null,"3"]
["30225",30225,30225,30225,30225,30225,null,"3"]
["30425",30425,30425,30425,30425,30425,null,"3"]
["39925",39925,39925,39925,39925,39925,null,"3"]
["30026",30026,{"$f":"B142","v":30026},30026,30026,30026,null,"3"]
["30126",30126,30126,30126,30126,30126,null,"3"]
["30426",30426,30426,30426,30426,30426,null,"3"]
["39926",39926,39926,39926,39926,39926,null,"3"]
["30027",30027,30027,30027,30027,30027,null,"3"]
["30127",30127,30127,30127,30127,30127,null,"3"]
["30427",30427,30427,30427,30427,30427,null,"3"]
["39927",39927,39927,39927,39927,39927,null,"3"]
["30028",30028,30028,30028,30028,30028,null,"3"]
["30329",30329,30329,30329,30329,30329,null,"3"]
["30428",30428,30428,30428,30428,30428,null,"3"]
["39928",39928,39928,39928,39928,39928,null,"3"]
["30088",30088,30088,30088,30088,30088,null,"3"]
["30188",30188,30188,30188,30188,30188,null,"3"]
["30488",30488,30488,30488,30488,30488,null,"3"]
["39988",39988,39988,39988,39988,39988,null,"3"]
["40101",40101,40101,40101,40101,40101,null,"4"]
["40102",40102,40102,40102,40102,40102,null,"4"]
["40103",40103,40103,40103,40103,40103,null,"4"]
["40104",40104,40104,40104,40104,40104,null,"4"]
["40105",40105,{"$f":"B162","v":40105},40105,40105,40105,null,"4"]
["40106",40106,40106,40106,40106,40106,null,"4"]
["40107",40107,40107,40107,40107,40107,null,"4"]
["40201",40201,40201,40201,40201,40201,null,"4"]
["40202",40202,40202,40202,40202,40202,null,"4"]
["40203",40203,40203,40203,40203,40203,null,"4"]
["40204",40204,40204,40204,40204,40204,null,"4"]
["40205",40205,40205,40205,40205,40205,null,"4"]
["40206",40206,40206,40206,40206,40206,null,"4"]
["40207",40207,40207,40207,40207,40207,null,"4"]
["40208",40208,40208,40208,40208,40208,null,"4"]
["40209",40209,40209,40209,40209,40209,null,"4"]
["40301",40301,40301,40301,40301,40301,null,"4"]
["40302",40302,40302,40302,40302,40302,null,"4"]
["40303",40303,40303,40303,40303,40303,null,"4"]
["40304",40304,40304,40304,40304,40304,null,"4"]
["40305",40305,40305,40305,40305,40305,null,"4"]
["40306",40306,40306,40306,40306,40306,null,"4"]
["40307",40307,40307,40307,40307,40307,null,"4"]
["40308",40308,40308,40308,40308,40308,null,"4"]
["40309",40309,{"$f":"B182","v":40309},40309,40309,40309,null,"4"]
["40310",40310,40310,40310,40310,40310,null,"4"]
["40311",40311,40311,40311,40311,40311,null,"4"]
["40312",40312,40312,40312,40312,40312,null,"4"]
["40313",40313,40313,40313,40313,40313,null,"4"]
["40314",40314,40314,40314,40314,40314,null,"4"]
["40315",40315,40315,40315,40315,40315,null,"4"]
["40316",40316,40316,40316,40316,40316,null,"4"]
["40317",40317,40317,40317,40317,40317,null,"4"]
["40318",40318,40318,40318,40318,40318,null,"4"]
["40319",{"$f":"VALUE(A192)","v":40319},40319,40319,40319,40319,null,{"$f":"LEFT(A192,1)","v":"4"}]
["40320",40320,40320,40320,40320,40320,null,"4"]
["40321",40321,40321,40321,40321,40321,null,"4"]
["40322",40322,40322,40322,40322,40322,null,"4"]
["40323",40323,{"$f":"B196","v":40323},40323,40323,40323,null,"4"]
["40324",40324,40324,40324,40324,40324,null,"4"]
[]
[]
[null,{"$f":"SUM(B2:B197)","v":5962600},{"$f":"SUM(C2:C197)","v":5962600},{"$f":"SUM(D2:D197)","v":5962600},{"$f":"SUM(E2:E197)","v":5962600},{"$f":"SUM(F2:F197)","v":5962600}]

{"sheet":"Paste","index":16,"n_rows":5,"n_cols":2,"rows_kept":5,"cut":false,"hidden":false,"merged":[]}
[null,"<-- Paste Short Absract Summary Excel Sheet here"]
[null,"Instructions:"]
[null,"1.        In Listbuilder, run the RW Short Abstract Summary with View set to XLS."]
[null,"2.        RW will produce on Excel spreadsheet. Paste the whole sheet onto the sheet in THIS workbook called Paste (this sheet) in the Abstract Form."]
[null,"3.        Double check the first page of the Abstract Form corresponds to the RealWare Short Abstract Summary."]

{"sheet":"Reference","index":17,"n_rows":201,"n_cols":12,"rows_kept":201,"cut":false,"hidden":false,"merged":[[9,7,19,7],[20,7,53,7],[0,7,8,7]]}
[null,"CountOfACCOUNTNO","SumOfRAWASSDVAL","SumOfACTVAL","SumOfACRES","SumOfSQFT",null,"IRRIGATED CROP",40101,"II LRA 1-2-3",4008,{"$f":"K2","v":3279}]
["00101",{"$f":"IF(ISERROR(VLOOKUP($A2,Paste!$B$5:$T$500,4,FALSE))=TRUE,0,VLOOKUP($A2,Paste!$B$5:$T$500,4,FALSE))","v":0},{"$f":"IF(ISERROR(VLOOKUP($A2,Paste!$B$5:$T$500,8,FALSE))=TRUE,0,VLOOKUP($A2,Paste!$B$5:$T$500,8,FALSE))","v":0},{"$f":"IF(ISERROR(VLOOKUP($A2,Paste!$B$5:$T$500,11,FALSE))=TRUE,0,VLOOKUP($A2,Paste!$B$5:$T$500,11,FALSE))","v":0},{"$f":"IF(ISERROR(VLOOKUP($A2,Paste!$B$5:$T$500,16,FALSE))=TRUE,0,VLOOKUP($A2,Paste!$B$5:$T$500,16,FALSE))","v":0},{"$f":"IF(ISERROR(VLOOKUP($A2,Paste!$B$5:$T$500,19,FALSE))=TRUE,0,VLOOKUP($A2,Paste!$B$5:$T$500,19,FALSE))","v":0},null,null,40102,"III LRA 1-2-3",3279,{"$f":"K3","v":2550}]
["00102",{"$f":"IF(ISERROR(VLOOKUP($A3,Paste!$B$5:$T$500,4,FALSE))=TRUE,0,VLOOKUP($A3,Paste!$B$5:$T$500,4,FALSE))","v":0},{"$f":"IF(ISERROR(VLOOKUP($A3,Paste!$B$5:$T$500,8,FALSE))=TRUE,0,VLOOKUP($A3,Paste!$B$5:$T$500,8,FALSE))","v":0},{"$f":"IF(ISERROR(VLOOKUP($A3,Paste!$B$5:$T$500,11,FALSE))=TRUE,0,VLOOKUP($A3,Paste!$B$5:$T$500,11,FALSE))","v":0},{"$f":"IF(ISERROR(VLOOKUP($A3,Paste!$B$5:$T$500,16,FALSE))=TRUE,0,VLOOKUP($A3,Paste!$B$5:$T$500,16,FALSE))","v":0},{"$f":"IF(ISERROR(VLOOKUP($A3,Paste!$B$5:$T$500,19,FALSE))=TRUE,0,VLOOKUP($A3,Paste!$B$5:$T$500,19,FALSE))","v":0},null,null,40103,"IV LRA 1-2-3",2550,{"$f":"K4","v":1822}]
["00103",{"$f":"IF(ISERROR(VLOOKUP($A4,Paste!$B$5:$T$500,4,FALSE))=TRUE,0,VLOOKUP($A4,Paste!$B$5:$T$500,4,FALSE))","v":0},{"$f":"IF(ISERROR(VLOOKUP($A4,Paste!$B$5:$T$500,8,FALSE))=TRUE,0,VLOOKUP($A4,Paste!$B$5:$T$500,8,FALSE))","v":0},{"$f":"IF(ISERROR(VLOOKUP($A4,Paste!$B$5:$T$500,11,FALSE))=TRUE,0,VLOOKUP($A4,Paste!$B$5:$T$500,11,FALSE))","v":0},{"$f":"IF(ISERROR(VLOOKUP($A4,Paste!$B$5:$T$500,16,FALSE))=TRUE,0,VLOOKUP($A4,Paste!$B$5:$T$500,16,FALSE))","v":0},{"$f":"IF(ISERROR(VLOOKUP($A4,Paste!$B$5:$T$500,19,FALSE))=TRUE,0,VLOOKUP($A4,Paste!$B$5:$T$500,19,FALSE))","v":0},null,null,40104,"V-VIII LRA 1-2-3",1822,729]
["00200",{"$f":"IF(ISERROR(VLOOKUP($A5,Paste!$B$5:$T$500,4,FALSE))=TRUE,0,VLOOKUP($A5,Paste!$B$5:$T$500,4,FALSE))","v":0},{"$f":"IF(ISERROR(VLOOKUP($A5,Paste!$B$5:$T$500,8,FALSE))=TRUE,0,VLOOKUP($A5,Paste!$B$5:$T$500,8,FALSE))","v":0},{"$f":"IF(ISERROR(VLOOKUP($A5,Paste!$B$5:$T$500,11,FALSE))=TRUE,0,VLOOKUP($A5,Paste!$B$5:$T$500,11,FALSE))","v":0},{"$f":"IF(ISERROR(VLOOKUP($A5,Paste!$B$5:$T$500,16,FALSE))=TRUE,0,VLOOKUP($A5,Paste!$B$5:$T$500,16,FALSE))","v":0},{"$f":"IF(ISERROR(VLOOKUP($A5,Paste!$B$5:$T$500,19,FALSE))=TRUE,0,VLOOKUP($A5,Paste!$B$5:$T$500,19,FALSE))","v":0}]
["00300",{"$f":"IF(ISERROR(VLOOKUP($A6,Paste!$B$5:$T$500,4,FALSE))=TRUE,0,VLOOKUP($A6,Paste!$B$5:$T$500,4,FALSE))","v":0},{"$f":"IF(ISERROR(VLOOKUP($A6,Paste!$B$5:$T$500,8,FALSE))=TRUE,0,VLOOKUP($A6,Paste!$B$5:$T$500,8,FALSE))","v":0},{"$f":"IF(ISERROR(VLOOKUP($A6,Paste!$B$5:$T$500,11,FALSE))=TRUE,0,VLOOKUP($A6,Paste!$B$5:$T$500,11,FALSE))","v":0},{"$f":"IF(ISERROR(VLOOKUP($A6,Paste!$B$5:$T$500,16,FALSE))=TRUE,0,VLOOKUP($A6,Paste!$B$5:$T$500,16,FALSE))","v":0},{"$f":"IF(ISERROR(VLOOKUP($A6,Paste!$B$5:$T$500,19,FALSE))=TRUE,0,VLOOKUP($A6,Paste!$B$5:$T$500,19,FALSE))","v":0},null,null,40105,"III LRA 4-5",2915,{"$f":"K7","v":2186}]
["00400",{"$f":"IF(ISERROR(VLOOKUP($A7,Paste!$B$5:$T$500,4,FALSE))=TRUE,0,VLOOKUP($A7,Paste!$B$5:$T$500,4,FALSE))","v":0},{"$f":"IF(ISERROR(VLOOKUP($A7,Paste!$B$5:$T$500,8,FALSE))=TRUE,0,VLOOKUP($A7,Paste!$B$5:$T$500,8,FALSE))","v":0},{"$f":"IF(ISERROR(VLOOKUP($A7,Paste!$B$5:$T$500,11,FALSE))=TRUE,0,VLOOKUP($A7,Paste!$B$5:$T$500,11,FALSE))","v":0},{"$f":"IF(ISERROR(VLOOKUP($A7,Paste!$B$5:$T$500,16,FALSE))=TRUE,0,VLOOKUP($A7,Paste!$B$5:$T$500,16,FALSE))","v":0},{"$f":"IF(ISERROR(VLOOKUP($A7,Paste!$B$5:$T$500,19,FALSE))=TRUE,0,VLOOKUP($A7,Paste!$B$5:$T$500,19,FALSE))","v":0},null,null,40106,"IV LRA 4-5",2186,{"$f":"K8","v":1457}]
["10001",{"$f":"IF(ISERROR(VLOOKUP($A8,Paste!$B$5:$T$500,4,FALSE))=TRUE,0,VLOOKUP($A8,Paste!$B$5:$T$500,4,FALSE))","v":0},{"$f":"IF(ISERROR(VLOOKUP($A8,Paste!$B$5:$T$500,8,FALSE))=TRUE,0,VLOOKUP($A8,Paste!$B$5:$T$500,8,FALSE))","v":0},{"$f":"IF(ISERROR(VLOOKUP($A8,Paste!$B$5:$T$500,11,FALSE))=TRUE,0,VLOOKUP($A8,Paste!$B$5:$T$500,11,FALSE))","v":0},{"$f":"IF(ISERROR(VLOOKUP($A8,Paste!$B$5:$T$500,16,FALSE))=TRUE,0,VLOOKUP($A8,Paste!$B$5:$T$500,16,FALSE))","v":0},{"$f":"IF(ISERROR(VLOOKUP($A8,Paste!$B$5:$T$500,19,FALSE))=TRUE,0,VLOOKUP($A8,Paste!$B$5:$T$500,19,FALSE))","v":0},null,null,40107,"V-VIII LRA 4-5",1457,729]
["10002",{"$f":"IF(ISERROR(VLOOKUP($A9,Paste!$B$5:$T$500,4,FALSE))=TRUE,0,VLOOKUP($A9,Paste!$B$5:$T$500,4,FALSE))","v":0},{"$f":"IF(ISERROR(VLOOKUP($A9,Paste!$B$5:$T$500,8,FALSE))=TRUE,0,VLOOKUP($A9,Paste!$B$5:$T$500,8,FALSE))","v":0},{"$f":"IF(ISERROR(VLOOKUP($A9,Paste!$B$5:$T$500,11,FALSE))=TRUE,0,VLOOKUP($A9,Paste!$B$5:$T$500,11,FALSE))","v":0},{"$f":"IF(ISERROR(VLOOKUP($A9,Paste!$B$5:$T$500,16,FALSE))=TRUE,0,VLOOKUP($A9,Paste!$B$5:$T$500,16,FALSE))","v":0},{"$f":"IF(ISERROR(VLOOKUP($A9,Paste!$B$5:$T$500,19,FALSE))=TRUE,0,VLOOKUP($A9,Paste!$B$5:$T$500,19,FALSE))","v":0},null,null,{"$f":"I8","v":40107},{"$f":"J8","v":"V-VIII LRA 4-5"},{"$f":"K8","v":1457},{"$f":"L8","v":729}]
["10003",{"$f":"IF(ISERROR(VLOOKUP($A10,Paste!$B$5:$T$500,4,FALSE))=TRUE,0,VLOOKUP($A10,Paste!$B$5:$T$500,4,FALSE))","v":0},{"$f":"IF(ISERROR(VLOOKUP($A10,Paste!$B$5:$T$500,8,FALSE))=TRUE,0,VLOOKUP($A10,Paste!$B$5:$T$500,8,FALSE))","v":0},{"$f":"IF(ISERROR(VLOOKUP($A10,Paste!$B$5:$T$500,11,FALSE))=TRUE,0,VLOOKUP($A10,Paste!$B$5:$T$500,11,FALSE))","v":0},{"$f":"IF(ISERROR(VLOOKUP($A10,Paste!$B$5:$T$500,16,FALSE))=TRUE,0,VLOOKUP($A10,Paste!$B$5:$T$500,16,FALSE))","v":0},{"$f":"IF(ISERROR(VLOOKUP($A10,Paste!$B$5:$T$500,19,FALSE))=TRUE,0,VLOOKUP($A10,Paste!$B$5:$T$500,19,FALSE))","v":0},null,"DR CROP",40201,"III LRA 4-5",535,{"$f":"K11","v":440}]
["10004",{"$f":"IF(ISERROR(VLOOKUP($A11,Paste!$B$5:$T$500,4,FALSE))=TRUE,0,VLOOKUP($A11,Paste!$B$5:$T$500,4,FALSE))","v":0},{"$f":"IF(ISERROR(VLOOKUP($A11,Paste!$B$5:$T$500,8,FALSE))=TRUE,0,VLOOKUP($A11,Paste!$B$5:$T$500,8,FALSE))","v":0},{"$f":"IF(ISERROR(VLOOKUP($A11,Paste!$B$5:$T$500,11,FALSE))=TRUE,0,VLOOKUP($A11,Paste!$B$5:$T$500,11,FALSE))","v":0},{"$f":"IF(ISERROR(VLOOKUP($A11,Paste!$B$5:$T$500,16,FALSE))=TRUE,0,VLOOKUP($A11,Paste!$B$5:$T$500,16,FALSE))","v":0},{"$f":"IF(ISERROR(VLOOKUP($A11,Paste!$B$5:$T$500,19,FALSE))=TRUE,0,VLOOKUP($A11,Paste!$B$5:$T$500,19,FALSE))","v":0},null,null,40202,"IV LRA 1-2-3",440,{"$f":"K12","v":346}]
["10005",{"$f":"IF(ISERROR(VLOOKUP($A12,Paste!$B$5:$T$500,4,FALSE))=TRUE,0,VLOOKUP($A12,Paste!$B$5:$T$500,4,FALSE))","v":0},{"$f":"IF(ISERROR(VLOOKUP($A12,Paste!$B$5:$T$500,8,FALSE))=TRUE,0,VLOOKUP($A12,Paste!$B$5:$T$500,8,FALSE))","v":0},{"$f":"IF(ISERROR(VLOOKUP($A12,Paste!$B$5:$T$500,11,FALSE))=TRUE,0,VLOOKUP($A12,Paste!$B$5:$T$500,11,FALSE))","v":0},{"$f":"IF(ISERROR(VLOOKUP($A12,Paste!$B$5:$T$500,16,FALSE))=TRUE,0,VLOOKUP($A12,Paste!$B$5:$T$500,16,FALSE))","v":0},{"$f":"IF(ISERROR(VLOOKUP($A12,Paste!$B$5:$T$500,19,FALSE))=TRUE,0,VLOOKUP($A12,Paste!$B$5:$T$500,19,FALSE))","v":0},null,null,40203,"V-VIII LRA 1-2-3",346,204]
["10101",{"$f":"IF(ISERROR(VLOOKUP($A13,Paste!$B$5:$T$500,4,FALSE))=TRUE,0,VLOOKUP($A13,Paste!$B$5:$T$500,4,FALSE))","v":0},{"$f":"IF(ISERROR(VLOOKUP($A13,Paste!$B$5:$T$500,8,FALSE))=TRUE,0,VLOOKUP($A13,Paste!$B$5:$T$500,8,FALSE))","v":0},{"$f":"IF(ISERROR(VLOOKUP($A13,Paste!$B$5:$T$500,11,FALSE))=TRUE,0,VLOOKUP($A13,Paste!$B$5:$T$500,11,FALSE))","v":0},{"$f":"IF(ISERROR(VLOOKUP($A13,Paste!$B$5:$T$500,16,FALSE))=TRUE,0,VLOOKUP($A13,Paste!$B$5:$T$500,16,FALSE))","v":0},{"$f":"IF(ISERROR(VLOOKUP($A13,Paste!$B$5:$T$500,19,FALSE))=TRUE,0,VLOOKUP($A13,Paste!$B$5:$T$500,19,FALSE))","v":0}]
["10102",{"$f":"IF(ISERROR(VLOOKUP($A14,Paste!$B$5:$T$500,4,FALSE))=TRUE,0,VLOOKUP($A14,Paste!$B$5:$T$500,4,FALSE))","v":0},{"$f":"IF(ISERROR(VLOOKUP($A14,Paste!$B$5:$T$500,8,FALSE))=TRUE,0,VLOOKUP($A14,Paste!$B$5:$T$500,8,FALSE))","v":0},{"$f":"IF(ISERROR(VLOOKUP($A14,Paste!$B$5:$T$500,11,FALSE))=TRUE,0,VLOOKUP($A14,Paste!$B$5:$T$500,11,FALSE))","v":0},{"$f":"IF(ISERROR(VLOOKUP($A14,Paste!$B$5:$T$500,16,FALSE))=TRUE,0,VLOOKUP($A14,Paste!$B$5:$T$500,16,FALSE))","v":0},{"$f":"IF(ISERROR(VLOOKUP($A14,Paste!$B$5:$T$500,19,FALSE))=TRUE,0,VLOOKUP($A14,Paste!$B$5:$T$500,19,FALSE))","v":0},null,null,40204,"III LRA 4",488,{"$f":"K15","v":346}]
["10103",{"$f":"IF(ISERROR(VLOOKUP($A15,Paste!$B$5:$T$500,4,FALSE))=TRUE,0,VLOOKUP($A15,Paste!$B$5:$T$500,4,FALSE))","v":0},{"$f":"IF(ISERROR(VLOOKUP($A15,Paste!$B$5:$T$500,8,FALSE))=TRUE,0,VLOOKUP($A15,Paste!$B$5:$T$500,8,FALSE))","v":0},{"$f":"IF(ISERROR(VLOOKUP($A15,Paste!$B$5:$T$500,11,FALSE))=TRUE,0,VLOOKUP($A15,Paste!$B$5:$T$500,11,FALSE))","v":0},{"$f":"IF(ISERROR(VLOOKUP($A15,Paste!$B$5:$T$500,16,FALSE))=TRUE,0,VLOOKUP($A15,Paste!$B$5:$T$500,16,FALSE))","v":0},{"$f":"IF(ISERROR(VLOOKUP($A15,Paste!$B$5:$T$500,19,FALSE))=TRUE,0,VLOOKUP($A15,Paste!$B$5:$T$500,19,FALSE))","v":0},null,null,40205,"IV LRA 4",346,{"$f":"K16","v":252}]
["10200",{"$f":"IF(ISERROR(VLOOKUP($A16,Paste!$B$5:$T$500,4,FALSE))=TRUE,0,VLOOKUP($A16,Paste!$B$5:$T$500,4,FALSE))","v":0},{"$f":"IF(ISERROR(VLOOKUP($A16,Paste!$B$5:$T$500,8,FALSE))=TRUE,0,VLOOKUP($A16,Paste!$B$5:$T$500,8,FALSE))","v":0},{"$f":"IF(ISERROR(VLOOKUP($A16,Paste!$B$5:$T$500,11,FALSE))=TRUE,0,VLOOKUP($A16,Paste!$B$5:$T$500,11,FALSE))","v":0},{"$f":"IF(ISERROR(VLOOKUP($A16,Paste!$B$5:$T$500,16,FALSE))=TRUE,0,VLOOKUP($A16,Paste!$B$5:$T$500,16,FALSE))","v":0},{"$f":"IF(ISERROR(VLOOKUP($A16,Paste!$B$5:$T$500,19,FALSE))=TRUE,0,VLOOKUP($A16,Paste!$B$5:$T$500,19,FALSE))","v":0},null,null,40206,"V-VIII LRA 4",252,157]
["10401",{"$f":"IF(ISERROR(VLOOKUP($A17,Paste!$B$5:$T$500,4,FALSE))=TRUE,0,VLOOKUP($A17,Paste!$B$5:$T$500,4,FALSE))","v":0},{"$f":"IF(ISERROR(VLOOKUP($A17,Paste!$B$5:$T$500,8,FALSE))=TRUE,0,VLOOKUP($A17,Paste!$B$5:$T$500,8,FALSE))","v":0},{"$f":"IF(ISERROR(VLOOKUP($A17,Paste!$B$5:$T$500,11,FALSE))=TRUE,0,VLOOKUP($A17,Paste!$B$5:$T$500,11,FALSE))","v":0},{"$f":"IF(ISERROR(VLOOKUP($A17,Paste!$B$5:$T$500,16,FALSE))=TRUE,0,VLOOKUP($A17,Paste!$B$5:$T$500,16,FALSE))","v":0},{"$f":"IF(ISERROR(VLOOKUP($A17,Paste!$B$5:$T$500,19,FALSE))=TRUE,0,VLOOKUP($A17,Paste!$B$5:$T$500,19,FALSE))","v":0}]
["10402",{"$f":"IF(ISERROR(VLOOKUP($A18,Paste!$B$5:$T$500,4,FALSE))=TRUE,0,VLOOKUP($A18,Paste!$B$5:$T$500,4,FALSE))","v":0},{"$f":"IF(ISERROR(VLOOKUP($A18,Paste!$B$5:$T$500,8,FALSE))=TRUE,0,VLOOKUP($A18,Paste!$B$5:$T$500,8,FALSE))","v":0},{"$f":"IF(ISERROR(VLOOKUP($A18,Paste!$B$5:$T$500,11,FALSE))=TRUE,0,VLOOKUP($A18,Paste!$B$5:$T$500,11,FALSE))","v":0},{"$f":"IF(ISERROR(VLOOKUP($A18,Paste!$B$5:$T$500,16,FALSE))=TRUE,0,VLOOKUP($A18,Paste!$B$5:$T$500,16,FALSE))","v":0},{"$f":"IF(ISERROR(VLOOKUP($A18,Paste!$B$5:$T$500,19,FALSE))=TRUE,0,VLOOKUP($A18,Paste!$B$5:$T$500,19,FALSE))","v":0},null,null,40207,"III LRA 5",724,{"$f":"K19","v":535}]
["10403",{"$f":"IF(ISERROR(VLOOKUP($A19,Paste!$B$5:$T$500,4,FALSE))=TRUE,0,VLOOKUP($A19,Paste!$B$5:$T$500,4,FALSE))","v":0},{"$f":"IF(ISERROR(VLOOKUP($A19,Paste!$B$5:$T$500,8,FALSE))=TRUE,0,VLOOKUP($A19,Paste!$B$5:$T$500,8,FALSE))","v":0},{"$f":"IF(ISERROR(VLOOKUP($A19,Paste!$B$5:$T$500,11,FALSE))=TRUE,0,VLOOKUP($A19,Paste!$B$5:$T$500,11,FALSE))","v":0},{"$f":"IF(ISERROR(VLOOKUP($A19,Paste!$B$5:$T$500,16,FALSE))=TRUE,0,VLOOKUP($A19,Paste!$B$5:$T$500,16,FALSE))","v":0},{"$f":"IF(ISERROR(VLOOKUP($A19,Paste!$B$5:$T$500,19,FALSE))=TRUE,0,VLOOKUP($A19,Paste!$B$5:$T$500,19,FALSE))","v":0},null,null,40208,"IV LRA 5",535,{"$f":"K20","v":346}]
["10500",{"$f":"IF(ISERROR(VLOOKUP($A20,Paste!$B$5:$T$500,4,FALSE))=TRUE,0,VLOOKUP($A20,Paste!$B$5:$T$500,4,FALSE))","v":0},{"$f":"IF(ISERROR(VLOOKUP($A20,Paste!$B$5:$T$500,8,FALSE))=TRUE,0,VLOOKUP($A20,Paste!$B$5:$T$500,8,FALSE))","v":0},{"$f":"IF(ISERROR(VLOOKUP($A20,Paste!$B$5:$T$500,11,FALSE))=TRUE,0,VLOOKUP($A20,Paste!$B$5:$T$500,11,FALSE))","v":0},{"$f":"IF(ISERROR(VLOOKUP($A20,Paste!$B$5:$T$500,16,FALSE))=TRUE,0,VLOOKUP($A20,Paste!$B$5:$T$500,16,FALSE))","v":0},{"$f":"IF(ISERROR(VLOOKUP($A20,Paste!$B$5:$T$500,19,FALSE))=TRUE,0,VLOOKUP($A20,Paste!$B$5:$T$500,19,FALSE))","v":0},null,null,40209,"V-VIII LRA 5",346,252]
["10600",{"$f":"IF(ISERROR(VLOOKUP($A21,Paste!$B$5:$T$500,4,FALSE))=TRUE,0,VLOOKUP($A21,Paste!$B$5:$T$500,4,FALSE))","v":0},{"$f":"IF(ISERROR(VLOOKUP($A21,Paste!$B$5:$T$500,8,FALSE))=TRUE,0,VLOOKUP($A21,Paste!$B$5:$T$500,8,FALSE))","v":0},{"$f":"IF(ISERROR(VLOOKUP($A21,Paste!$B$5:$T$500,11,FALSE))=TRUE,0,VLOOKUP($A21,Paste!$B$5:$T$500,11,FALSE))","v":0},{"$f":"IF(ISERROR(VLOOKUP($A21,Paste!$B$5:$T$500,16,FALSE))=TRUE,0,VLOOKUP($A21,Paste!$B$5:$T$500,16,FALSE))","v":0},{"$f":"IF(ISERROR(VLOOKUP($A21,Paste!$B$5:$T$500,19,FALSE))=TRUE,0,VLOOKUP($A21,Paste!$B$5:$T$500,19,FALSE))","v":0},null,"RANGE LAND",40301,"1 LRA1",1087,649]
["20000",{"$f":"IF(ISERROR(VLOOKUP($A22,Paste!$B$5:$T$500,4,FALSE))=TRUE,0,VLOOKUP($A22,Paste!$B$5:$T$500,4,FALSE))","v":0},{"$f":"IF(ISERROR(VLOOKUP($A22,Paste!$B$5:$T$500,8,FALSE))=TRUE,0,VLOOKUP($A22,Paste!$B$5:$T$500,8,FALSE))","v":0},{"$f":"IF(ISERROR(VLOOKUP($A22,Paste!$B$5:$T$500,11,FALSE))=TRUE,0,VLOOKUP($A22,Paste!$B$5:$T$500,11,FALSE))","v":0},{"$f":"IF(ISERROR(VLOOKUP($A22,Paste!$B$5:$T$500,16,FALSE))=TRUE,0,VLOOKUP($A22,Paste!$B$5:$T$500,16,FALSE))","v":0},{"$f":"IF(ISERROR(VLOOKUP($A22,Paste!$B$5:$T$500,19,FALSE))=TRUE,0,VLOOKUP($A22,Paste!$B$5:$T$500,19,FALSE))","v":0},null,null,40302,"2 LRA1",362,{"$f":"K23","v":272}]
["20100",{"$f":"IF(ISERROR(VLOOKUP($A23,Paste!$B$5:$T$500,4,FALSE))=TRUE,0,VLOOKUP($A23,Paste!$B$5:$T$500,4,FALSE))","v":0},{"$f":"IF(ISERROR(VLOOKUP($A23,Paste!$B$5:$T$500,8,FALSE))=TRUE,0,VLOOKUP($A23,Paste!$B$5:$T$500,8,FALSE))","v":0},{"$f":"IF(ISERROR(VLOOKUP($A23,Paste!$B$5:$T$500,11,FALSE))=TRUE,0,VLOOKUP($A23,Paste!$B$5:$T$500,11,FALSE))","v":0},{"$f":"IF(ISERROR(VLOOKUP($A23,Paste!$B$5:$T$500,16,FALSE))=TRUE,0,VLOOKUP($A23,Paste!$B$5:$T$500,16,FALSE))","v":0},{"$f":"IF(ISERROR(VLOOKUP($A23,Paste!$B$5:$T$500,19,FALSE))=TRUE,0,VLOOKUP($A23,Paste!$B$5:$T$500,19,FALSE))","v":0},null,null,40303,"3 LRA1",272,181]
["20200",{"$f":"IF(ISERROR(VLOOKUP($A24,Paste!$B$5:$T$500,4,FALSE))=TRUE,0,VLOOKUP($A24,Paste!$B$5:$T$500,4,FALSE))","v":0},{"$f":"IF(ISERROR(VLOOKUP($A24,Paste!$B$5:$T$500,8,FALSE))=TRUE,0,VLOOKUP($A24,Paste!$B$5:$T$500,8,FALSE))","v":0},{"$f":"IF(ISERROR(VLOOKUP($A24,Paste!$B$5:$T$500,11,FALSE))=TRUE,0,VLOOKUP($A24,Paste!$B$5:$T$500,11,FALSE))","v":0},{"$f":"IF(ISERROR(VLOOKUP($A24,Paste!$B$5:$T$500,16,FALSE))=TRUE,0,VLOOKUP($A24,Paste!$B$5:$T$500,16,FALSE))","v":0},{"$f":"IF(ISERROR(VLOOKUP($A24,Paste!$B$5:$T$500,19,FALSE))=TRUE,0,VLOOKUP($A24,Paste!$B$5:$T$500,19,FALSE))","v":0},null,null,40304,"4 LRA1",181,136]
["20300",{"$f":"IF(ISERROR(VLOOKUP($A25,Paste!$B$5:$T$500,4,FALSE))=TRUE,0,VLOOKUP($A25,Paste!$B$5:$T$500,4,FALSE))","v":0},{"$f":"IF(ISERROR(VLOOKUP($A25,Paste!$B$5:$T$500,8,FALSE))=TRUE,0,VLOOKUP($A25,Paste!$B$5:$T$500,8,FALSE))","v":0},{"$f":"IF(ISERROR(VLOOKUP($A25,Paste!$B$5:$T$500,11,FALSE))=TRUE,0,VLOOKUP($A25,Paste!$B$5:$T$500,11,FALSE))","v":0},{"$f":"IF(ISERROR(VLOOKUP($A25,Paste!$B$5:$T$500,16,FALSE))=TRUE,0,VLOOKUP($A25,Paste!$B$5:$T$500,16,FALSE))","v":0},{"$f":"IF(ISERROR(VLOOKUP($A25,Paste!$B$5:$T$500,19,FALSE))=TRUE,0,VLOOKUP($A25,Paste!$B$5:$T$500,19,FALSE))","v":0},null,null,40305,"5 LRA1",136,91]
["20400",{"$f":"IF(ISERROR(VLOOKUP($A26,Paste!$B$5:$T$500,4,FALSE))=TRUE,0,VLOOKUP($A26,Paste!$B$5:$T$500,4,FALSE))","v":0},{"$f":"IF(ISERROR(VLOOKUP($A26,Paste!$B$5:$T$500,8,FALSE))=TRUE,0,VLOOKUP($A26,Paste!$B$5:$T$500,8,FALSE))","v":0},{"$f":"IF(ISERROR(VLOOKUP($A26,Paste!$B$5:$T$500,11,FALSE))=TRUE,0,VLOOKUP($A26,Paste!$B$5:$T$500,11,FALSE))","v":0},{"$f":"IF(ISERROR(VLOOKUP($A26,Paste!$B$5:$T$500,16,FALSE))=TRUE,0,VLOOKUP($A26,Paste!$B$5:$T$500,16,FALSE))","v":0},{"$f":"IF(ISERROR(VLOOKUP($A26,Paste!$B$5:$T$500,19,FALSE))=TRUE,0,VLOOKUP($A26,Paste!$B$5:$T$500,19,FALSE))","v":0},null,null,40306,"W LRA1",91,10]
["20500",{"$f":"IF(ISERROR(VLOOKUP($A27,Paste!$B$5:$T$500,4,FALSE))=TRUE,0,VLOOKUP($A27,Paste!$B$5:$T$500,4,FALSE))","v":0},{"$f":"IF(ISERROR(VLOOKUP($A27,Paste!$B$5:$T$500,8,FALSE))=TRUE,0,VLOOKUP($A27,Paste!$B$5:$T$500,8,FALSE))","v":0},{"$f":"IF(ISERROR(VLOOKUP($A27,Paste!$B$5:$T$500,11,FALSE))=TRUE,0,VLOOKUP($A27,Paste!$B$5:$T$500,11,FALSE))","v":0},{"$f":"IF(ISERROR(VLOOKUP($A27,Paste!$B$5:$T$500,16,FALSE))=TRUE,0,VLOOKUP($A27,Paste!$B$5:$T$500,16,FALSE))","v":0},{"$f":"IF(ISERROR(VLOOKUP($A27,Paste!$B$5:$T$500,19,FALSE))=TRUE,0,VLOOKUP($A27,Paste!$B$5:$T$500,19,FALSE))","v":0}]
["20600",{"$f":"IF(ISERROR(VLOOKUP($A28,Paste!$B$5:$T$500,4,FALSE))=TRUE,0,VLOOKUP($A28,Paste!$B$5:$T$500,4,FALSE))","v":0},{"$f":"IF(ISERROR(VLOOKUP($A28,Paste!$B$5:$T$500,8,FALSE))=TRUE,0,VLOOKUP($A28,Paste!$B$5:$T$500,8,FALSE))","v":0},{"$f":"IF(ISERROR(VLOOKUP($A28,Paste!$B$5:$T$500,11,FALSE))=TRUE,0,VLOOKUP($A28,Paste!$B$5:$T$500,11,FALSE))","v":0},{"$f":"IF(ISERROR(VLOOKUP($A28,Paste!$B$5:$T$500,16,FALSE))=TRUE,0,VLOOKUP($A28,Paste!$B$5:$T$500,16,FALSE))","v":0},{"$f":"IF(ISERROR(VLOOKUP($A28,Paste!$B$5:$T$500,19,FALSE))=TRUE,0,VLOOKUP($A28,Paste!$B$5:$T$500,19,FALSE))","v":0},null,null,40307,"1 LRA2",1054,498]
["20701",{"$f":"IF(ISERROR(VLOOKUP($A29,Paste!$B$5:$T$500,4,FALSE))=TRUE,0,VLOOKUP($A29,Paste!$B$5:$T$500,4,FALSE))","v":0},{"$f":"IF(ISERROR(VLOOKUP($A29,Paste!$B$5:$T$500,8,FALSE))=TRUE,0,VLOOKUP($A29,Paste!$B$5:$T$500,8,FALSE))","v":0},{"$f":"IF(ISERROR(VLOOKUP($A29,Paste!$B$5:$T$500,11,FALSE))=TRUE,0,VLOOKUP($A29,Paste!$B$5:$T$500,11,FALSE))","v":0},{"$f":"IF(ISERROR(VLOOKUP($A29,Paste!$B$5:$T$500,16,FALSE))=TRUE,0,VLOOKUP($A29,Paste!$B$5:$T$500,16,FALSE))","v":0},{"$f":"IF(ISERROR(VLOOKUP($A29,Paste!$B$5:$T$500,19,FALSE))=TRUE,0,VLOOKUP($A29,Paste!$B$5:$T$500,19,FALSE))","v":0},null,null,40308,"2 LRA2",272,181]
["20702",{"$f":"IF(ISERROR(VLOOKUP($A30,Paste!$B$5:$T$500,4,FALSE))=TRUE,0,VLOOKUP($A30,Paste!$B$5:$T$500,4,FALSE))","v":0},{"$f":"IF(ISERROR(VLOOKUP($A30,Paste!$B$5:$T$500,8,FALSE))=TRUE,0,VLOOKUP($A30,Paste!$B$5:$T$500,8,FALSE))","v":0},{"$f":"IF(ISERROR(VLOOKUP($A30,Paste!$B$5:$T$500,11,FALSE))=TRUE,0,VLOOKUP($A30,Paste!$B$5:$T$500,11,FALSE))","v":0},{"$f":"IF(ISERROR(VLOOKUP($A30,Paste!$B$5:$T$500,16,FALSE))=TRUE,0,VLOOKUP($A30,Paste!$B$5:$T$500,16,FALSE))","v":0},{"$f":"IF(ISERROR(VLOOKUP($A30,Paste!$B$5:$T$500,19,FALSE))=TRUE,0,VLOOKUP($A30,Paste!$B$5:$T$500,19,FALSE))","v":0},null,null,40309,"3 LRA2",181,136]
["20703",{"$f":"IF(ISERROR(VLOOKUP($A31,Paste!$B$5:$T$500,4,FALSE))=TRUE,0,VLOOKUP($A31,Paste!$B$5:$T$500,4,FALSE))","v":0},{"$f":"IF(ISERROR(VLOOKUP($A31,Paste!$B$5:$T$500,8,FALSE))=TRUE,0,VLOOKUP($A31,Paste!$B$5:$T$500,8,FALSE))","v":0},{"$f":"IF(ISERROR(VLOOKUP($A31,Paste!$B$5:$T$500,11,FALSE))=TRUE,0,VLOOKUP($A31,Paste!$B$5:$T$500,11,FALSE))","v":0},{"$f":"IF(ISERROR(VLOOKUP($A31,Paste!$B$5:$T$500,16,FALSE))=TRUE,0,VLOOKUP($A31,Paste!$B$5:$T$500,16,FALSE))","v":0},{"$f":"IF(ISERROR(VLOOKUP($A31,Paste!$B$5:$T$500,19,FALSE))=TRUE,0,VLOOKUP($A31,Paste!$B$5:$T$500,19,FALSE))","v":0},null,null,40310,"4 LRA2",136,91]
["20800",{"$f":"IF(ISERROR(VLOOKUP($A32,Paste!$B$5:$T$500,4,FALSE))=TRUE,0,VLOOKUP($A32,Paste!$B$5:$T$500,4,FALSE))","v":0},{"$f":"IF(ISERROR(VLOOKUP($A32,Paste!$B$5:$T$500,8,FALSE))=TRUE,0,VLOOKUP($A32,Paste!$B$5:$T$500,8,FALSE))","v":0},{"$f":"IF(ISERROR(VLOOKUP($A32,Paste!$B$5:$T$500,11,FALSE))=TRUE,0,VLOOKUP($A32,Paste!$B$5:$T$500,11,FALSE))","v":0},{"$f":"IF(ISERROR(VLOOKUP($A32,Paste!$B$5:$T$500,16,FALSE))=TRUE,0,VLOOKUP($A32,Paste!$B$5:$T$500,16,FALSE))","v":0},{"$f":"IF(ISERROR(VLOOKUP($A32,Paste!$B$5:$T$500,19,FALSE))=TRUE,0,VLOOKUP($A32,Paste!$B$5:$T$500,19,FALSE))","v":0},null,null,40311,"5 LRA2",91,45]
["20900",{"$f":"IF(ISERROR(VLOOKUP($A33,Paste!$B$5:$T$500,4,FALSE))=TRUE,0,VLOOKUP($A33,Paste!$B$5:$T$500,4,FALSE))","v":0},{"$f":"IF(ISERROR(VLOOKUP($A33,Paste!$B$5:$T$500,8,FALSE))=TRUE,0,VLOOKUP($A33,Paste!$B$5:$T$500,8,FALSE))","v":0},{"$f":"IF(ISERROR(VLOOKUP($A33,Paste!$B$5:$T$500,11,FALSE))=TRUE,0,VLOOKUP($A33,Paste!$B$5:$T$500,11,FALSE))","v":0},{"$f":"IF(ISERROR(VLOOKUP($A33,Paste!$B$5:$T$500,16,FALSE))=TRUE,0,VLOOKUP($A33,Paste!$B$5:$T$500,16,FALSE))","v":0},{"$f":"IF(ISERROR(VLOOKUP($A33,Paste!$B$5:$T$500,19,FALSE))=TRUE,0,VLOOKUP($A33,Paste!$B$5:$T$500,19,FALSE))","v":0},null,null,40312,"W LRA2",45,10]
["21000",{"$f":"IF(ISERROR(VLOOKUP($A34,Paste!$B$5:$T$500,4,FALSE))=TRUE,0,VLOOKUP($A34,Paste!$B$5:$T$500,4,FALSE))","v":0},{"$f":"IF(ISERROR(VLOOKUP($A34,Paste!$B$5:$T$500,8,FALSE))=TRUE,0,VLOOKUP($A34,Paste!$B$5:$T$500,8,FALSE))","v":0},{"$f":"IF(ISERROR(VLOOKUP($A34,Paste!$B$5:$T$500,11,FALSE))=TRUE,0,VLOOKUP($A34,Paste!$B$5:$T$500,11,FALSE))","v":0},{"$f":"IF(ISERROR(VLOOKUP($A34,Paste!$B$5:$T$500,16,FALSE))=TRUE,0,VLOOKUP($A34,Paste!$B$5:$T$500,16,FALSE))","v":0},{"$f":"IF(ISERROR(VLOOKUP($A34,Paste!$B$5:$T$500,19,FALSE))=TRUE,0,VLOOKUP($A34,Paste!$B$5:$T$500,19,FALSE))","v":0}]
["21100",{"$f":"IF(ISERROR(VLOOKUP($A35,Paste!$B$5:$T$500,4,FALSE))=TRUE,0,VLOOKUP($A35,Paste!$B$5:$T$500,4,FALSE))","v":0},{"$f":"IF(ISERROR(VLOOKUP($A35,Paste!$B$5:$T$500,8,FALSE))=TRUE,0,VLOOKUP($A35,Paste!$B$5:$T$500,8,FALSE))","v":0},{"$f":"IF(ISERROR(VLOOKUP($A35,Paste!$B$5:$T$500,11,FALSE))=TRUE,0,VLOOKUP($A35,Paste!$B$5:$T$500,11,FALSE))","v":0},{"$f":"IF(ISERROR(VLOOKUP($A35,Paste!$B$5:$T$500,16,FALSE))=TRUE,0,VLOOKUP($A35,Paste!$B$5:$T$500,16,FALSE))","v":0},{"$f":"IF(ISERROR(VLOOKUP($A35,Paste!$B$5:$T$500,19,FALSE))=TRUE,0,VLOOKUP($A35,Paste!$B$5:$T$500,19,FALSE))","v":0},null,null,40313,"1 LRA3",906,433]
["21201",{"$f":"IF(ISERROR(VLOOKUP($A36,Paste!$B$5:$T$500,4,FALSE))=TRUE,0,VLOOKUP($A36,Paste!$B$5:$T$500,4,FALSE))","v":0},{"$f":"IF(ISERROR(VLOOKUP($A36,Paste!$B$5:$T$500,8,FALSE))=TRUE,0,VLOOKUP($A36,Paste!$B$5:$T$500,8,FALSE))","v":0},{"$f":"IF(ISERROR(VLOOKUP($A36,Paste!$B$5:$T$500,11,FALSE))=TRUE,0,VLOOKUP($A36,Paste!$B$5:$T$500,11,FALSE))","v":0},{"$f":"IF(ISERROR(VLOOKUP($A36,Paste!$B$5:$T$500,16,FALSE))=TRUE,0,VLOOKUP($A36,Paste!$B$5:$T$500,16,FALSE))","v":0},{"$f":"IF(ISERROR(VLOOKUP($A36,Paste!$B$5:$T$500,19,FALSE))=TRUE,0,VLOOKUP($A36,Paste!$B$5:$T$500,19,FALSE))","v":0},null,null,40314,"2 LRA3",181,{"$f":"K37","v":136}]
["21301",{"$f":"IF(ISERROR(VLOOKUP($A37,Paste!$B$5:$T$500,4,FALSE))=TRUE,0,VLOOKUP($A37,Paste!$B$5:$T$500,4,FALSE))","v":0},{"$f":"IF(ISERROR(VLOOKUP($A37,Paste!$B$5:$T$500,8,FALSE))=TRUE,0,VLOOKUP($A37,Paste!$B$5:$T$500,8,FALSE))","v":0},{"$f":"IF(ISERROR(VLOOKUP($A37,Paste!$B$5:$T$500,11,FALSE))=TRUE,0,VLOOKUP($A37,Paste!$B$5:$T$500,11,FALSE))","v":0},{"$f":"IF(ISERROR(VLOOKUP($A37,Paste!$B$5:$T$500,16,FALSE))=TRUE,0,VLOOKUP($A37,Paste!$B$5:$T$500,16,FALSE))","v":0},{"$f":"IF(ISERROR(VLOOKUP($A37,Paste!$B$5:$T$500,19,FALSE))=TRUE,0,VLOOKUP($A37,Paste!$B$5:$T$500,19,FALSE))","v":0},null,null,40315,"3 LRA3",136,{"$f":"K38","v":91}]
["21302",{"$f":"IF(ISERROR(VLOOKUP($A38,Paste!$B$5:$T$500,4,FALSE))=TRUE,0,VLOOKUP($A38,Paste!$B$5:$T$500,4,FALSE))","v":0},{"$f":"IF(ISERROR(VLOOKUP($A38,Paste!$B$5:$T$500,8,FALSE))=TRUE,0,VLOOKUP($A38,Paste!$B$5:$T$500,8,FALSE))","v":0},{"$f":"IF(ISERROR(VLOOKUP($A38,Paste!$B$5:$T$500,11,FALSE))=TRUE,0,VLOOKUP($A38,Paste!$B$5:$T$500,11,FALSE))","v":0},{"$f":"IF(ISERROR(VLOOKUP($A38,Paste!$B$5:$T$500,16,FALSE))=TRUE,0,VLOOKUP($A38,Paste!$B$5:$T$500,16,FALSE))","v":0},{"$f":"IF(ISERROR(VLOOKUP($A38,Paste!$B$5:$T$500,19,FALSE))=TRUE,0,VLOOKUP($A38,Paste!$B$5:$T$500,19,FALSE))","v":0},null,null,40316,"4 LRA3",91,45]
["21303",{"$f":"IF(ISERROR(VLOOKUP($A39,Paste!$B$5:$T$500,4,FALSE))=TRUE,0,VLOOKUP($A39,Paste!$B$5:$T$500,4,FALSE))","v":0},{"$f":"IF(ISERROR(VLOOKUP($A39,Paste!$B$5:$T$500,8,FALSE))=TRUE,0,VLOOKUP($A39,Paste!$B$5:$T$500,8,FALSE))","v":0},{"$f":"IF(ISERROR(VLOOKUP($A39,Paste!$B$5:$T$500,11,FALSE))=TRUE,0,VLOOKUP($A39,Paste!$B$5:$T$500,11,FALSE))","v":0},{"$f":"IF(ISERROR(VLOOKUP($A39,Paste!$B$5:$T$500,16,FALSE))=TRUE,0,VLOOKUP($A39,Paste!$B$5:$T$500,16,FALSE))","v":0},{"$f":"IF(ISERROR(VLOOKUP($A39,Paste!$B$5:$T$500,19,FALSE))=TRUE,0,VLOOKUP($A39,Paste!$B$5:$T$500,19,FALSE))","v":0},null,null,40317,"5 LRA3",45,23]
["21304",{"$f":"IF(ISERROR(VLOOKUP($A40,Paste!$B$5:$T$500,4,FALSE))=TRUE,0,VLOOKUP($A40,Paste!$B$5:$T$500,4,FALSE))","v":0},{"$f":"IF(ISERROR(VLOOKUP($A40,Paste!$B$5:$T$500,8,FALSE))=TRUE,0,VLOOKUP($A40,Paste!$B$5:$T$500,8,FALSE))","v":0},{"$f":"IF(ISERROR(VLOOKUP($A40,Paste!$B$5:$T$500,11,FALSE))=TRUE,0,VLOOKUP($A40,Paste!$B$5:$T$500,11,FALSE))","v":0},{"$f":"IF(ISERROR(VLOOKUP($A40,Paste!$B$5:$T$500,16,FALSE))=TRUE,0,VLOOKUP($A40,Paste!$B$5:$T$500,16,FALSE))","v":0},{"$f":"IF(ISERROR(VLOOKUP($A40,Paste!$B$5:$T$500,19,FALSE))=TRUE,0,VLOOKUP($A40,Paste!$B$5:$T$500,19,FALSE))","v":0},null,null,40318,"W LRA3",23,10]
["29900",{"$f":"IF(ISERROR(VLOOKUP($A41,Paste!$B$5:$T$500,4,FALSE))=TRUE,0,VLOOKUP($A41,Paste!$B$5:$T$500,4,FALSE))","v":0},{"$f":"IF(ISERROR(VLOOKUP($A41,Paste!$B$5:$T$500,8,FALSE))=TRUE,0,VLOOKUP($A41,Paste!$B$5:$T$500,8,FALSE))","v":0},{"$f":"IF(ISERROR(VLOOKUP($A41,Paste!$B$5:$T$500,11,FALSE))=TRUE,0,VLOOKUP($A41,Paste!$B$5:$T$500,11,FALSE))","v":0},{"$f":"IF(ISERROR(VLOOKUP($A41,Paste!$B$5:$T$500,16,FALSE))=TRUE,0,VLOOKUP($A41,Paste!$B$5:$T$500,16,FALSE))","v":0},{"$f":"IF(ISERROR(VLOOKUP($A41,Paste!$B$5:$T$500,19,FALSE))=TRUE,0,VLOOKUP($A41,Paste!$B$5:$T$500,19,FALSE))","v":0}]
["30001",{"$f":"IF(ISERROR(VLOOKUP($A42,Paste!$B$5:$T$500,4,FALSE))=TRUE,0,VLOOKUP($A42,Paste!$B$5:$T$500,4,FALSE))","v":0},{"$f":"IF(ISERROR(VLOOKUP($A42,Paste!$B$5:$T$500,8,FALSE))=TRUE,0,VLOOKUP($A42,Paste!$B$5:$T$500,8,FALSE))","v":0},{"$f":"IF(ISERROR(VLOOKUP($A42,Paste!$B$5:$T$500,11,FALSE))=TRUE,0,VLOOKUP($A42,Paste!$B$5:$T$500,11,FALSE))","v":0},{"$f":"IF(ISERROR(VLOOKUP($A42,Paste!$B$5:$T$500,16,FALSE))=TRUE,0,VLOOKUP($A42,Paste!$B$5:$T$500,16,FALSE))","v":0},{"$f":"IF(ISERROR(VLOOKUP($A42,Paste!$B$5:$T$500,19,FALSE))=TRUE,0,VLOOKUP($A42,Paste!$B$5:$T$500,19,FALSE))","v":0},null,null,40313,"1 LRA4",906,433]
["30002",{"$f":"IF(ISERROR(VLOOKUP($A43,Paste!$B$5:$T$500,4,FALSE))=TRUE,0,VLOOKUP($A43,Paste!$B$5:$T$500,4,FALSE))","v":0},{"$f":"IF(ISERROR(VLOOKUP($A43,Paste!$B$5:$T$500,8,FALSE))=TRUE,0,VLOOKUP($A43,Paste!$B$5:$T$500,8,FALSE))","v":0},{"$f":"IF(ISERROR(VLOOKUP($A43,Paste!$B$5:$T$500,11,FALSE))=TRUE,0,VLOOKUP($A43,Paste!$B$5:$T$500,11,FALSE))","v":0},{"$f":"IF(ISERROR(VLOOKUP($A43,Paste!$B$5:$T$500,16,FALSE))=TRUE,0,VLOOKUP($A43,Paste!$B$5:$T$500,16,FALSE))","v":0},{"$f":"IF(ISERROR(VLOOKUP($A43,Paste!$B$5:$T$500,19,FALSE))=TRUE,0,VLOOKUP($A43,Paste!$B$5:$T$500,19,FALSE))","v":0},null,null,40314,"2 LRA4",181,{"$f":"K44","v":136}]
["30003",{"$f":"IF(ISERROR(VLOOKUP($A44,Paste!$B$5:$T$500,4,FALSE))=TRUE,0,VLOOKUP($A44,Paste!$B$5:$T$500,4,FALSE))","v":0},{"$f":"IF(ISERROR(VLOOKUP($A44,Paste!$B$5:$T$500,8,FALSE))=TRUE,0,VLOOKUP($A44,Paste!$B$5:$T$500,8,FALSE))","v":0},{"$f":"IF(ISERROR(VLOOKUP($A44,Paste!$B$5:$T$500,11,FALSE))=TRUE,0,VLOOKUP($A44,Paste!$B$5:$T$500,11,FALSE))","v":0},{"$f":"IF(ISERROR(VLOOKUP($A44,Paste!$B$5:$T$500,16,FALSE))=TRUE,0,VLOOKUP($A44,Paste!$B$5:$T$500,16,FALSE))","v":0},{"$f":"IF(ISERROR(VLOOKUP($A44,Paste!$B$5:$T$500,19,FALSE))=TRUE,0,VLOOKUP($A44,Paste!$B$5:$T$500,19,FALSE))","v":0},null,null,40315,"3 LRA4",136,{"$f":"K45","v":91}]
["30004",{"$f":"IF(ISERROR(VLOOKUP($A45,Paste!$B$5:$T$500,4,FALSE))=TRUE,0,VLOOKUP($A45,Paste!$B$5:$T$500,4,FALSE))","v":0},{"$f":"IF(ISERROR(VLOOKUP($A45,Paste!$B$5:$T$500,8,FALSE))=TRUE,0,VLOOKUP($A45,Paste!$B$5:$T$500,8,FALSE))","v":0},{"$f":"IF(ISERROR(VLOOKUP($A45,Paste!$B$5:$T$500,11,FALSE))=TRUE,0,VLOOKUP($A45,Paste!$B$5:$T$500,11,FALSE))","v":0},{"$f":"IF(ISERROR(VLOOKUP($A45,Paste!$B$5:$T$500,16,FALSE))=TRUE,0,VLOOKUP($A45,Paste!$B$5:$T$500,16,FALSE))","v":0},{"$f":"IF(ISERROR(VLOOKUP($A45,Paste!$B$5:$T$500,19,FALSE))=TRUE,0,VLOOKUP($A45,Paste!$B$5:$T$500,19,FALSE))","v":0},null,null,40316,"4 LRA4",91,45]
["30005",{"$f":"IF(ISERROR(VLOOKUP($A46,Paste!$B$5:$T$500,4,FALSE))=TRUE,0,VLOOKUP($A46,Paste!$B$5:$T$500,4,FALSE))","v":0},{"$f":"IF(ISERROR(VLOOKUP($A46,Paste!$B$5:$T$500,8,FALSE))=TRUE,0,VLOOKUP($A46,Paste!$B$5:$T$500,8,FALSE))","v":0},{"$f":"IF(ISERROR(VLOOKUP($A46,Paste!$B$5:$T$500,11,FALSE))=TRUE,0,VLOOKUP($A46,Paste!$B$5:$T$500,11,FALSE))","v":0},{"$f":"IF(ISERROR(VLOOKUP($A46,Paste!$B$5:$T$500,16,FALSE))=TRUE,0,VLOOKUP($A46,Paste!$B$5:$T$500,16,FALSE))","v":0},{"$f":"IF(ISERROR(VLOOKUP($A46,Paste!$B$5:$T$500,19,FALSE))=TRUE,0,VLOOKUP($A46,Paste!$B$5:$T$500,19,FALSE))","v":0},null,null,40317,"5 LRA4",45,23]
["30006",{"$f":"IF(ISERROR(VLOOKUP($A47,Paste!$B$5:$T$500,4,FALSE))=TRUE,0,VLOOKUP($A47,Paste!$B$5:$T$500,4,FALSE))","v":0},{"$f":"IF(ISERROR(VLOOKUP($A47,Paste!$B$5:$T$500,8,FALSE))=TRUE,0,VLOOKUP($A47,Paste!$B$5:$T$500,8,FALSE))","v":0},{"$f":"IF(ISERROR(VLOOKUP($A47,Paste!$B$5:$T$500,11,FALSE))=TRUE,0,VLOOKUP($A47,Paste!$B$5:$T$500,11,FALSE))","v":0},{"$f":"IF(ISERROR(VLOOKUP($A47,Paste!$B$5:$T$500,16,FALSE))=TRUE,0,VLOOKUP($A47,Paste!$B$5:$T$500,16,FALSE))","v":0},{"$f":"IF(ISERROR(VLOOKUP($A47,Paste!$B$5:$T$500,19,FALSE))=TRUE,0,VLOOKUP($A47,Paste!$B$5:$T$500,19,FALSE))","v":0},null,null,40318,"W LRA4",23,10]
["30007",{"$f":"IF(ISERROR(VLOOKUP($A48,Paste!$B$5:$T$500,4,FALSE))=TRUE,0,VLOOKUP($A48,Paste!$B$5:$T$500,4,FALSE))","v":0},{"$f":"IF(ISERROR(VLOOKUP($A48,Paste!$B$5:$T$500,8,FALSE))=TRUE,0,VLOOKUP($A48,Paste!$B$5:$T$500,8,FALSE))","v":0},{"$f":"IF(ISERROR(VLOOKUP($A48,Paste!$B$5:$T$500,11,FALSE))=TRUE,0,VLOOKUP($A48,Paste!$B$5:$T$500,11,FALSE))","v":0},{"$f":"IF(ISERROR(VLOOKUP($A48,Paste!$B$5:$T$500,16,FALSE))=TRUE,0,VLOOKUP($A48,Paste!$B$5:$T$500,16,FALSE))","v":0},{"$f":"IF(ISERROR(VLOOKUP($A48,Paste!$B$5:$T$500,19,FALSE))=TRUE,0,VLOOKUP($A48,Paste!$B$5:$T$500,19,FALSE))","v":0}]
["30008",{"$f":"IF(ISERROR(VLOOKUP($A49,Paste!$B$5:$T$500,4,FALSE))=TRUE,0,VLOOKUP($A49,Paste!$B$5:$T$500,4,FALSE))","v":0},{"$f":"IF(ISERROR(VLOOKUP($A49,Paste!$B$5:$T$500,8,FALSE))=TRUE,0,VLOOKUP($A49,Paste!$B$5:$T$500,8,FALSE))","v":0},{"$f":"IF(ISERROR(VLOOKUP($A49,Paste!$B$5:$T$500,11,FALSE))=TRUE,0,VLOOKUP($A49,Paste!$B$5:$T$500,11,FALSE))","v":0},{"$f":"IF(ISERROR(VLOOKUP($A49,Paste!$B$5:$T$500,16,FALSE))=TRUE,0,VLOOKUP($A49,Paste!$B$5:$T$500,16,FALSE))","v":0},{"$f":"IF(ISERROR(VLOOKUP($A49,Paste!$B$5:$T$500,19,FALSE))=TRUE,0,VLOOKUP($A49,Paste!$B$5:$T$500,19,FALSE))","v":0},null,null,40319,"1 LRA5",725,346]
["30009",{"$f":"IF(ISERROR(VLOOKUP($A50,Paste!$B$5:$T$500,4,FALSE))=TRUE,0,VLOOKUP($A50,Paste!$B$5:$T$500,4,FALSE))","v":0},{"$f":"IF(ISERROR(VLOOKUP($A50,Paste!$B$5:$T$500,8,FALSE))=TRUE,0,VLOOKUP($A50,Paste!$B$5:$T$500,8,FALSE))","v":0},{"$f":"IF(ISERROR(VLOOKUP($A50,Paste!$B$5:$T$500,11,FALSE))=TRUE,0,VLOOKUP($A50,Paste!$B$5:$T$500,11,FALSE))","v":0},{"$f":"IF(ISERROR(VLOOKUP($A50,Paste!$B$5:$T$500,16,FALSE))=TRUE,0,VLOOKUP($A50,Paste!$B$5:$T$500,16,FALSE))","v":0},{"$f":"IF(ISERROR(VLOOKUP($A50,Paste!$B$5:$T$500,19,FALSE))=TRUE,0,VLOOKUP($A50,Paste!$B$5:$T$500,19,FALSE))","v":0},null,null,40320,"2 LRA5",136,{"$f":"K51","v":91}]
["30010",{"$f":"IF(ISERROR(VLOOKUP($A51,Paste!$B$5:$T$500,4,FALSE))=TRUE,0,VLOOKUP($A51,Paste!$B$5:$T$500,4,FALSE))","v":0},{"$f":"IF(ISERROR(VLOOKUP($A51,Paste!$B$5:$T$500,8,FALSE))=TRUE,0,VLOOKUP($A51,Paste!$B$5:$T$500,8,FALSE))","v":0},{"$f":"IF(ISERROR(VLOOKUP($A51,Paste!$B$5:$T$500,11,FALSE))=TRUE,0,VLOOKUP($A51,Paste!$B$5:$T$500,11,FALSE))","v":0},{"$f":"IF(ISERROR(VLOOKUP($A51,Paste!$B$5:$T$500,16,FALSE))=TRUE,0,VLOOKUP($A51,Paste!$B$5:$T$500,16,FALSE))","v":0},{"$f":"IF(ISERROR(VLOOKUP($A51,Paste!$B$5:$T$500,19,FALSE))=TRUE,0,VLOOKUP($A51,Paste!$B$5:$T$500,19,FALSE))","v":0},null,null,40321,"3 LRA5",91,{"$f":"K52","v":45}]
["30011",{"$f":"IF(ISERROR(VLOOKUP($A52,Paste!$B$5:$T$500,4,FALSE))=TRUE,0,VLOOKUP($A52,Paste!$B$5:$T$500,4,FALSE))","v":0},{"$f":"IF(ISERROR(VLOOKUP($A52,Paste!$B$5:$T$500,8,FALSE))=TRUE,0,VLOOKUP($A52,Paste!$B$5:$T$500,8,FALSE))","v":0},{"$f":"IF(ISERROR(VLOOKUP($A52,Paste!$B$5:$T$500,11,FALSE))=TRUE,0,VLOOKUP($A52,Paste!$B$5:$T$500,11,FALSE))","v":0},{"$f":"IF(ISERROR(VLOOKUP($A52,Paste!$B$5:$T$500,16,FALSE))=TRUE,0,VLOOKUP($A52,Paste!$B$5:$T$500,16,FALSE))","v":0},{"$f":"IF(ISERROR(VLOOKUP($A52,Paste!$B$5:$T$500,19,FALSE))=TRUE,0,VLOOKUP($A52,Paste!$B$5:$T$500,19,FALSE))","v":0},null,null,40322,"4 LRA5",45,23]
["30012",{"$f":"IF(ISERROR(VLOOKUP($A53,Paste!$B$5:$T$500,4,FALSE))=TRUE,0,VLOOKUP($A53,Paste!$B$5:$T$500,4,FALSE))","v":0},{"$f":"IF(ISERROR(VLOOKUP($A53,Paste!$B$5:$T$500,8,FALSE))=TRUE,0,VLOOKUP($A53,Paste!$B$5:$T$500,8,FALSE))","v":0},{"$f":"IF(ISERROR(VLOOKUP($A53,Paste!$B$5:$T$500,11,FALSE))=TRUE,0,VLOOKUP($A53,Paste!$B$5:$T$500,11,FALSE))","v":0},{"$f":"IF(ISERROR(VLOOKUP($A53,Paste!$B$5:$T$500,16,FALSE))=TRUE,0,VLOOKUP($A53,Paste!$B$5:$T$500,16,FALSE))","v":0},{"$f":"IF(ISERROR(VLOOKUP($A53,Paste!$B$5:$T$500,19,FALSE))=TRUE,0,VLOOKUP($A53,Paste!$B$5:$T$500,19,FALSE))","v":0},null,null,40323,"5 LRA5",23,10]
["30013",{"$f":"IF(ISERROR(VLOOKUP($A54,Paste!$B$5:$T$500,4,FALSE))=TRUE,0,VLOOKUP($A54,Paste!$B$5:$T$500,4,FALSE))","v":0},{"$f":"IF(ISERROR(VLOOKUP($A54,Paste!$B$5:$T$500,8,FALSE))=TRUE,0,VLOOKUP($A54,Paste!$B$5:$T$500,8,FALSE))","v":0},{"$f":"IF(ISERROR(VLOOKUP($A54,Paste!$B$5:$T$500,11,FALSE))=TRUE,0,VLOOKUP($A54,Paste!$B$5:$T$500,11,FALSE))","v":0},{"$f":"IF(ISERROR(VLOOKUP($A54,Paste!$B$5:$T$500,16,FALSE))=TRUE,0,VLOOKUP($A54,Paste!$B$5:$T$500,16,FALSE))","v":0},{"$f":"IF(ISERROR(VLOOKUP($A54,Paste!$B$5:$T$500,19,FALSE))=TRUE,0,VLOOKUP($A54,Paste!$B$5:$T$500,19,FALSE))","v":0},null,null,40324,"W LRA5",10,10]
["30014",{"$f":"IF(ISERROR(VLOOKUP($A55,Paste!$B$5:$T$500,4,FALSE))=TRUE,0,VLOOKUP($A55,Paste!$B$5:$T$500,4,FALSE))","v":0},{"$f":"IF(ISERROR(VLOOKUP($A55,Paste!$B$5:$T$500,8,FALSE))=TRUE,0,VLOOKUP($A55,Paste!$B$5:$T$500,8,FALSE))","v":0},{"$f":"IF(ISERROR(VLOOKUP($A55,Paste!$B$5:$T$500,11,FALSE))=TRUE,0,VLOOKUP($A55,Paste!$B$5:$T$500,11,FALSE))","v":0},{"$f":"IF(ISERROR(VLOOKUP($A55,Paste!$B$5:$T$500,16,FALSE))=TRUE,0,VLOOKUP($A55,Paste!$B$5:$T$500,16,FALSE))","v":0},{"$f":"IF(ISERROR(VLOOKUP($A55,Paste!$B$5:$T$500,19,FALSE))=TRUE,0,VLOOKUP($A55,Paste!$B$5:$T$500,19,FALSE))","v":0}]
["30015",{"$f":"IF(ISERROR(VLOOKUP($A56,Paste!$B$5:$T$500,4,FALSE))=TRUE,0,VLOOKUP($A56,Paste!$B$5:$T$500,4,FALSE))","v":0},{"$f":"IF(ISERROR(VLOOKUP($A56,Paste!$B$5:$T$500,8,FALSE))=TRUE,0,VLOOKUP($A56,Paste!$B$5:$T$500,8,FALSE))","v":0},{"$f":"IF(ISERROR(VLOOKUP($A56,Paste!$B$5:$T$500,11,FALSE))=TRUE,0,VLOOKUP($A56,Paste!$B$5:$T$500,11,FALSE))","v":0},{"$f":"IF(ISERROR(VLOOKUP($A56,Paste!$B$5:$T$500,16,FALSE))=TRUE,0,VLOOKUP($A56,Paste!$B$5:$T$500,16,FALSE))","v":0},{"$f":"IF(ISERROR(VLOOKUP($A56,Paste!$B$5:$T$500,19,FALSE))=TRUE,0,VLOOKUP($A56,Paste!$B$5:$T$500,19,FALSE))","v":0}]
["30016",{"$f":"IF(ISERROR(VLOOKUP($A57,Paste!$B$5:$T$500,4,FALSE))=TRUE,0,VLOOKUP($A57,Paste!$B$5:$T$500,4,FALSE))","v":0},{"$f":"IF(ISERROR(VLOOKUP($A57,Paste!$B$5:$T$500,8,FALSE))=TRUE,0,VLOOKUP($A57,Paste!$B$5:$T$500,8,FALSE))","v":0},{"$f":"IF(ISERROR(VLOOKUP($A57,Paste!$B$5:$T$500,11,FALSE))=TRUE,0,VLOOKUP($A57,Paste!$B$5:$T$500,11,FALSE))","v":0},{"$f":"IF(ISERROR(VLOOKUP($A57,Paste!$B$5:$T$500,16,FALSE))=TRUE,0,VLOOKUP($A57,Paste!$B$5:$T$500,16,FALSE))","v":0},{"$f":"IF(ISERROR(VLOOKUP($A57,Paste!$B$5:$T$500,19,FALSE))=TRUE,0,VLOOKUP($A57,Paste!$B$5:$T$500,19,FALSE))","v":0}]
["30017",{"$f":"IF(ISERROR(VLOOKUP($A58,Paste!$B$5:$T$500,4,FALSE))=TRUE,0,VLOOKUP($A58,Paste!$B$5:$T$500,4,FALSE))","v":0},{"$f":"IF(ISERROR(VLOOKUP($A58,Paste!$B$5:$T$500,8,FALSE))=TRUE,0,VLOOKUP($A58,Paste!$B$5:$T$500,8,FALSE))","v":0},{"$f":"IF(ISERROR(VLOOKUP($A58,Paste!$B$5:$T$500,11,FALSE))=TRUE,0,VLOOKUP($A58,Paste!$B$5:$T$500,11,FALSE))","v":0},{"$f":"IF(ISERROR(VLOOKUP($A58,Paste!$B$5:$T$500,16,FALSE))=TRUE,0,VLOOKUP($A58,Paste!$B$5:$T$500,16,FALSE))","v":0},{"$f":"IF(ISERROR(VLOOKUP($A58,Paste!$B$5:$T$500,19,FALSE))=TRUE,0,VLOOKUP($A58,Paste!$B$5:$T$500,19,FALSE))","v":0}]
["30018",{"$f":"IF(ISERROR(VLOOKUP($A59,Paste!$B$5:$T$500,4,FALSE))=TRUE,0,VLOOKUP($A59,Paste!$B$5:$T$500,4,FALSE))","v":0},{"$f":"IF(ISERROR(VLOOKUP($A59,Paste!$B$5:$T$500,8,FALSE))=TRUE,0,VLOOKUP($A59,Paste!$B$5:$T$500,8,FALSE))","v":0},{"$f":"IF(ISERROR(VLOOKUP($A59,Paste!$B$5:$T$500,11,FALSE))=TRUE,0,VLOOKUP($A59,Paste!$B$5:$T$500,11,FALSE))","v":0},{"$f":"IF(ISERROR(VLOOKUP($A59,Paste!$B$5:$T$500,16,FALSE))=TRUE,0,VLOOKUP($A59,Paste!$B$5:$T$500,16,FALSE))","v":0},{"$f":"IF(ISERROR(VLOOKUP($A59,Paste!$B$5:$T$500,19,FALSE))=TRUE,0,VLOOKUP($A59,Paste!$B$5:$T$500,19,FALSE))","v":0}]
["30019",{"$f":"IF(ISERROR(VLOOKUP($A60,Paste!$B$5:$T$500,4,FALSE))=TRUE,0,VLOOKUP($A60,Paste!$B$5:$T$500,4,FALSE))","v":0},{"$f":"IF(ISERROR(VLOOKUP($A60,Paste!$B$5:$T$500,8,FALSE))=TRUE,0,VLOOKUP($A60,Paste!$B$5:$T$500,8,FALSE))","v":0},{"$f":"IF(ISERROR(VLOOKUP($A60,Paste!$B$5:$T$500,11,FALSE))=TRUE,0,VLOOKUP($A60,Paste!$B$5:$T$500,11,FALSE))","v":0},{"$f":"IF(ISERROR(VLOOKUP($A60,Paste!$B$5:$T$500,16,FALSE))=TRUE,0,VLOOKUP($A60,Paste!$B$5:$T$500,16,FALSE))","v":0},{"$f":"IF(ISERROR(VLOOKUP($A60,Paste!$B$5:$T$500,19,FALSE))=TRUE,0,VLOOKUP($A60,Paste!$B$5:$T$500,19,FALSE))","v":0}]
["30020",{"$f":"IF(ISERROR(VLOOKUP($A61,Paste!$B$5:$T$500,4,FALSE))=TRUE,0,VLOOKUP($A61,Paste!$B$5:$T$500,4,FALSE))","v":0},{"$f":"IF(ISERROR(VLOOKUP($A61,Paste!$B$5:$T$500,8,FALSE))=TRUE,0,VLOOKUP($A61,Paste!$B$5:$T$500,8,FALSE))","v":0},{"$f":"IF(ISERROR(VLOOKUP($A61,Paste!$B$5:$T$500,11,FALSE))=TRUE,0,VLOOKUP($A61,Paste!$B$5:$T$500,11,FALSE))","v":0},{"$f":"IF(ISERROR(VLOOKUP($A61,Paste!$B$5:$T$500,16,FALSE))=TRUE,0,VLOOKUP($A61,Paste!$B$5:$T$500,16,FALSE))","v":0},{"$f":"IF(ISERROR(VLOOKUP($A61,Paste!$B$5:$T$500,19,FALSE))=TRUE,0,VLOOKUP($A61,Paste!$B$5:$T$500,19,FALSE))","v":0}]
["30021",{"$f":"IF(ISERROR(VLOOKUP($A62,Paste!$B$5:$T$500,4,FALSE))=TRUE,0,VLOOKUP($A62,Paste!$B$5:$T$500,4,FALSE))","v":0},{"$f":"IF(ISERROR(VLOOKUP($A62,Paste!$B$5:$T$500,8,FALSE))=TRUE,0,VLOOKUP($A62,Paste!$B$5:$T$500,8,FALSE))","v":0},{"$f":"IF(ISERROR(VLOOKUP($A62,Paste!$B$5:$T$500,11,FALSE))=TRUE,0,VLOOKUP($A62,Paste!$B$5:$T$500,11,FALSE))","v":0},{"$f":"IF(ISERROR(VLOOKUP($A62,Paste!$B$5:$T$500,16,FALSE))=TRUE,0,VLOOKUP($A62,Paste!$B$5:$T$500,16,FALSE))","v":0},{"$f":"IF(ISERROR(VLOOKUP($A62,Paste!$B$5:$T$500,19,FALSE))=TRUE,0,VLOOKUP($A62,Paste!$B$5:$T$500,19,FALSE))","v":0}]
["30022",{"$f":"IF(ISERROR(VLOOKUP($A63,Paste!$B$5:$T$500,4,FALSE))=TRUE,0,VLOOKUP($A63,Paste!$B$5:$T$500,4,FALSE))","v":0},{"$f":"IF(ISERROR(VLOOKUP($A63,Paste!$B$5:$T$500,8,FALSE))=TRUE,0,VLOOKUP($A63,Paste!$B$5:$T$500,8,FALSE))","v":0},{"$f":"IF(ISERROR(VLOOKUP($A63,Paste!$B$5:$T$500,11,FALSE))=TRUE,0,VLOOKUP($A63,Paste!$B$5:$T$500,11,FALSE))","v":0},{"$f":"IF(ISERROR(VLOOKUP($A63,Paste!$B$5:$T$500,16,FALSE))=TRUE,0,VLOOKUP($A63,Paste!$B$5:$T$500,16,FALSE))","v":0},{"$f":"IF(ISERROR(VLOOKUP($A63,Paste!$B$5:$T$500,19,FALSE))=TRUE,0,VLOOKUP($A63,Paste!$B$5:$T$500,19,FALSE))","v":0}]
["30023",{"$f":"IF(ISERROR(VLOOKUP($A64,Paste!$B$5:$T$500,4,FALSE))=TRUE,0,VLOOKUP($A64,Paste!$B$5:$T$500,4,FALSE))","v":0},{"$f":"IF(ISERROR(VLOOKUP($A64,Paste!$B$5:$T$500,8,FALSE))=TRUE,0,VLOOKUP($A64,Paste!$B$5:$T$500,8,FALSE))","v":0},{"$f":"IF(ISERROR(VLOOKUP($A64,Paste!$B$5:$T$500,11,FALSE))=TRUE,0,VLOOKUP($A64,Paste!$B$5:$T$500,11,FALSE))","v":0},{"$f":"IF(ISERROR(VLOOKUP($A64,Paste!$B$5:$T$500,16,FALSE))=TRUE,0,VLOOKUP($A64,Paste!$B$5:$T$500,16,FALSE))","v":0},{"$f":"IF(ISERROR(VLOOKUP($A64,Paste!$B$5:$T$500,19,FALSE))=TRUE,0,VLOOKUP($A64,Paste!$B$5:$T$500,19,FALSE))","v":0}]
["30024",{"$f":"IF(ISERROR(VLOOKUP($A65,Paste!$B$5:$T$500,4,FALSE))=TRUE,0,VLOOKUP($A65,Paste!$B$5:$T$500,4,FALSE))","v":0},{"$f":"IF(ISERROR(VLOOKUP($A65,Paste!$B$5:$T$500,8,FALSE))=TRUE,0,VLOOKUP($A65,Paste!$B$5:$T$500,8,FALSE))","v":0},{"$f":"IF(ISERROR(VLOOKUP($A65,Paste!$B$5:$T$500,11,FALSE))=TRUE,0,VLOOKUP($A65,Paste!$B$5:$T$500,11,FALSE))","v":0},{"$f":"IF(ISERROR(VLOOKUP($A65,Paste!$B$5:$T$500,16,FALSE))=TRUE,0,VLOOKUP($A65,Paste!$B$5:$T$500,16,FALSE))","v":0},{"$f":"IF(ISERROR(VLOOKUP($A65,Paste!$B$5:$T$500,19,FALSE))=TRUE,0,VLOOKUP($A65,Paste!$B$5:$T$500,19,FALSE))","v":0}]
["30025",{"$f":"IF(ISERROR(VLOOKUP($A66,Paste!$B$5:$T$500,4,FALSE))=TRUE,0,VLOOKUP($A66,Paste!$B$5:$T$500,4,FALSE))","v":0},{"$f":"IF(ISERROR(VLOOKUP($A66,Paste!$B$5:$T$500,8,FALSE))=TRUE,0,VLOOKUP($A66,Paste!$B$5:$T$500,8,FALSE))","v":0},{"$f":"IF(ISERROR(VLOOKUP($A66,Paste!$B$5:$T$500,11,FALSE))=TRUE,0,VLOOKUP($A66,Paste!$B$5:$T$500,11,FALSE))","v":0},{"$f":"IF(ISERROR(VLOOKUP($A66,Paste!$B$5:$T$500,16,FALSE))=TRUE,0,VLOOKUP($A66,Paste!$B$5:$T$500,16,FALSE))","v":0},{"$f":"IF(ISERROR(VLOOKUP($A66,Paste!$B$5:$T$500,19,FALSE))=TRUE,0,VLOOKUP($A66,Paste!$B$5:$T$500,19,FALSE))","v":0}]
["30026",{"$f":"IF(ISERROR(VLOOKUP($A67,Paste!$B$5:$T$500,4,FALSE))=TRUE,0,VLOOKUP($A67,Paste!$B$5:$T$500,4,FALSE))","v":0},{"$f":"IF(ISERROR(VLOOKUP($A67,Paste!$B$5:$T$500,8,FALSE))=TRUE,0,VLOOKUP($A67,Paste!$B$5:$T$500,8,FALSE))","v":0},{"$f":"IF(ISERROR(VLOOKUP($A67,Paste!$B$5:$T$500,11,FALSE))=TRUE,0,VLOOKUP($A67,Paste!$B$5:$T$500,11,FALSE))","v":0},{"$f":"IF(ISERROR(VLOOKUP($A67,Paste!$B$5:$T$500,16,FALSE))=TRUE,0,VLOOKUP($A67,Paste!$B$5:$T$500,16,FALSE))","v":0},{"$f":"IF(ISERROR(VLOOKUP($A67,Paste!$B$5:$T$500,19,FALSE))=TRUE,0,VLOOKUP($A67,Paste!$B$5:$T$500,19,FALSE))","v":0}]
["30027",{"$f":"IF(ISERROR(VLOOKUP($A68,Paste!$B$5:$T$500,4,FALSE))=TRUE,0,VLOOKUP($A68,Paste!$B$5:$T$500,4,FALSE))","v":0},{"$f":"IF(ISERROR(VLOOKUP($A68,Paste!$B$5:$T$500,8,FALSE))=TRUE,0,VLOOKUP($A68,Paste!$B$5:$T$500,8,FALSE))","v":0},{"$f":"IF(ISERROR(VLOOKUP($A68,Paste!$B$5:$T$500,11,FALSE))=TRUE,0,VLOOKUP($A68,Paste!$B$5:$T$500,11,FALSE))","v":0},{"$f":"IF(ISERROR(VLOOKUP($A68,Paste!$B$5:$T$500,16,FALSE))=TRUE,0,VLOOKUP($A68,Paste!$B$5:$T$500,16,FALSE))","v":0},{"$f":"IF(ISERROR(VLOOKUP($A68,Paste!$B$5:$T$500,19,FALSE))=TRUE,0,VLOOKUP($A68,Paste!$B$5:$T$500,19,FALSE))","v":0}]
["30028",{"$f":"IF(ISERROR(VLOOKUP($A69,Paste!$B$5:$T$500,4,FALSE))=TRUE,0,VLOOKUP($A69,Paste!$B$5:$T$500,4,FALSE))","v":0},{"$f":"IF(ISERROR(VLOOKUP($A69,Paste!$B$5:$T$500,8,FALSE))=TRUE,0,VLOOKUP($A69,Paste!$B$5:$T$500,8,FALSE))","v":0},{"$f":"IF(ISERROR(VLOOKUP($A69,Paste!$B$5:$T$500,11,FALSE))=TRUE,0,VLOOKUP($A69,Paste!$B$5:$T$500,11,FALSE))","v":0},{"$f":"IF(ISERROR(VLOOKUP($A69,Paste!$B$5:$T$500,16,FALSE))=TRUE,0,VLOOKUP($A69,Paste!$B$5:$T$500,16,FALSE))","v":0},{"$f":"IF(ISERROR(VLOOKUP($A69,Paste!$B$5:$T$500,19,FALSE))=TRUE,0,VLOOKUP($A69,Paste!$B$5:$T$500,19,FALSE))","v":0}]
["30029",{"$f":"IF(ISERROR(VLOOKUP($A70,Paste!$B$5:$T$500,4,FALSE))=TRUE,0,VLOOKUP($A70,Paste!$B$5:$T$500,4,FALSE))","v":0},{"$f":"IF(ISERROR(VLOOKUP($A70,Paste!$B$5:$T$500,8,FALSE))=TRUE,0,VLOOKUP($A70,Paste!$B$5:$T$500,8,FALSE))","v":0},{"$f":"IF(ISERROR(VLOOKUP($A70,Paste!$B$5:$T$500,11,FALSE))=TRUE,0,VLOOKUP($A70,Paste!$B$5:$T$500,11,FALSE))","v":0},{"$f":"IF(ISERROR(VLOOKUP($A70,Paste!$B$5:$T$500,16,FALSE))=TRUE,0,VLOOKUP($A70,Paste!$B$5:$T$500,16,FALSE))","v":0},{"$f":"IF(ISERROR(VLOOKUP($A70,Paste!$B$5:$T$500,19,FALSE))=TRUE,0,VLOOKUP($A70,Paste!$B$5:$T$500,19,FALSE))","v":0}]
["30088",{"$f":"IF(ISERROR(VLOOKUP($A71,Paste!$B$5:$T$500,4,FALSE))=TRUE,0,VLOOKUP($A71,Paste!$B$5:$T$500,4,FALSE))","v":0},{"$f":"IF(ISERROR(VLOOKUP($A71,Paste!$B$5:$T$500,8,FALSE))=TRUE,0,VLOOKUP($A71,Paste!$B$5:$T$500,8,FALSE))","v":0},{"$f":"IF(ISERROR(VLOOKUP($A71,Paste!$B$5:$T$500,11,FALSE))=TRUE,0,VLOOKUP($A71,Paste!$B$5:$T$500,11,FALSE))","v":0},{"$f":"IF(ISERROR(VLOOKUP($A71,Paste!$B$5:$T$500,16,FALSE))=TRUE,0,VLOOKUP($A71,Paste!$B$5:$T$500,16,FALSE))","v":0},{"$f":"IF(ISERROR(VLOOKUP($A71,Paste!$B$5:$T$500,19,FALSE))=TRUE,0,VLOOKUP($A71,Paste!$B$5:$T$500,19,FALSE))","v":0}]
["30101",{"$f":"IF(ISERROR(VLOOKUP($A72,Paste!$B$5:$T$500,4,FALSE))=TRUE,0,VLOOKUP($A72,Paste!$B$5:$T$500,4,FALSE))","v":0},{"$f":"IF(ISERROR(VLOOKUP($A72,Paste!$B$5:$T$500,8,FALSE))=TRUE,0,VLOOKUP($A72,Paste!$B$5:$T$500,8,FALSE))","v":0},{"$f":"IF(ISERROR(VLOOKUP($A72,Paste!$B$5:$T$500,11,FALSE))=TRUE,0,VLOOKUP($A72,Paste!$B$5:$T$500,11,FALSE))","v":0},{"$f":"IF(ISERROR(VLOOKUP($A72,Paste!$B$5:$T$500,16,FALSE))=TRUE,0,VLOOKUP($A72,Paste!$B$5:$T$500,16,FALSE))","v":0},{"$f":"IF(ISERROR(VLOOKUP($A72,Paste!$B$5:$T$500,19,FALSE))=TRUE,0,VLOOKUP($A72,Paste!$B$5:$T$500,19,FALSE))","v":0}]
["30102",{"$f":"IF(ISERROR(VLOOKUP($A73,Paste!$B$5:$T$500,4,FALSE))=TRUE,0,VLOOKUP($A73,Paste!$B$5:$T$500,4,FALSE))","v":0},{"$f":"IF(ISERROR(VLOOKUP($A73,Paste!$B$5:$T$500,8,FALSE))=TRUE,0,VLOOKUP($A73,Paste!$B$5:$T$500,8,FALSE))","v":0},{"$f":"IF(ISERROR(VLOOKUP($A73,Paste!$B$5:$T$500,11,FALSE))=TRUE,0,VLOOKUP($A73,Paste!$B$5:$T$500,11,FALSE))","v":0},{"$f":"IF(ISERROR(VLOOKUP($A73,Paste!$B$5:$T$500,16,FALSE))=TRUE,0,VLOOKUP($A73,Paste!$B$5:$T$500,16,FALSE))","v":0},{"$f":"IF(ISERROR(VLOOKUP($A73,Paste!$B$5:$T$500,19,FALSE))=TRUE,0,VLOOKUP($A73,Paste!$B$5:$T$500,19,FALSE))","v":0}]
["30103",{"$f":"IF(ISERROR(VLOOKUP($A74,Paste!$B$5:$T$500,4,FALSE))=TRUE,0,VLOOKUP($A74,Paste!$B$5:$T$500,4,FALSE))","v":0},{"$f":"IF(ISERROR(VLOOKUP($A74,Paste!$B$5:$T$500,8,FALSE))=TRUE,0,VLOOKUP($A74,Paste!$B$5:$T$500,8,FALSE))","v":0},{"$f":"IF(ISERROR(VLOOKUP($A74,Paste!$B$5:$T$500,11,FALSE))=TRUE,0,VLOOKUP($A74,Paste!$B$5:$T$500,11,FALSE))","v":0},{"$f":"IF(ISERROR(VLOOKUP($A74,Paste!$B$5:$T$500,16,FALSE))=TRUE,0,VLOOKUP($A74,Paste!$B$5:$T$500,16,FALSE))","v":0},{"$f":"IF(ISERROR(VLOOKUP($A74,Paste!$B$5:$T$500,19,FALSE))=TRUE,0,VLOOKUP($A74,Paste!$B$5:$T$500,19,FALSE))","v":0}]
["30104",{"$f":"IF(ISERROR(VLOOKUP($A75,Paste!$B$5:$T$500,4,FALSE))=TRUE,0,VLOOKUP($A75,Paste!$B$5:$T$500,4,FALSE))","v":0},{"$f":"IF(ISERROR(VLOOKUP($A75,Paste!$B$5:$T$500,8,FALSE))=TRUE,0,VLOOKUP($A75,Paste!$B$5:$T$500,8,FALSE))","v":0},{"$f":"IF(ISERROR(VLOOKUP($A75,Paste!$B$5:$T$500,11,FALSE))=TRUE,0,VLOOKUP($A75,Paste!$B$5:$T$500,11,FALSE))","v":0},{"$f":"IF(ISERROR(VLOOKUP($A75,Paste!$B$5:$T$500,16,FALSE))=TRUE,0,VLOOKUP($A75,Paste!$B$5:$T$500,16,FALSE))","v":0},{"$f":"IF(ISERROR(VLOOKUP($A75,Paste!$B$5:$T$500,19,FALSE))=TRUE,0,VLOOKUP($A75,Paste!$B$5:$T$500,19,FALSE))","v":0}]
["30105",{"$f":"IF(ISERROR(VLOOKUP($A76,Paste!$B$5:$T$500,4,FALSE))=TRUE,0,VLOOKUP($A76,Paste!$B$5:$T$500,4,FALSE))","v":0},{"$f":"IF(ISERROR(VLOOKUP($A76,Paste!$B$5:$T$500,8,FALSE))=TRUE,0,VLOOKUP($A76,Paste!$B$5:$T$500,8,FALSE))","v":0},{"$f":"IF(ISERROR(VLOOKUP($A76,Paste!$B$5:$T$500,11,FALSE))=TRUE,0,VLOOKUP($A76,Paste!$B$5:$T$500,11,FALSE))","v":0},{"$f":"IF(ISERROR(VLOOKUP($A76,Paste!$B$5:$T$500,16,FALSE))=TRUE,0,VLOOKUP($A76,Paste!$B$5:$T$500,16,FALSE))","v":0},{"$f":"IF(ISERROR(VLOOKUP($A76,Paste!$B$5:$T$500,19,FALSE))=TRUE,0,VLOOKUP($A76,Paste!$B$5:$T$500,19,FALSE))","v":0}]
["30106",{"$f":"IF(ISERROR(VLOOKUP($A77,Paste!$B$5:$T$500,4,FALSE))=TRUE,0,VLOOKUP($A77,Paste!$B$5:$T$500,4,FALSE))","v":0},{"$f":"IF(ISERROR(VLOOKUP($A77,Paste!$B$5:$T$500,8,FALSE))=TRUE,0,VLOOKUP($A77,Paste!$B$5:$T$500,8,FALSE))","v":0},{"$f":"IF(ISERROR(VLOOKUP($A77,Paste!$B$5:$T$500,11,FALSE))=TRUE,0,VLOOKUP($A77,Paste!$B$5:$T$500,11,FALSE))","v":0},{"$f":"IF(ISERROR(VLOOKUP($A77,Paste!$B$5:$T$500,16,FALSE))=TRUE,0,VLOOKUP($A77,Paste!$B$5:$T$500,16,FALSE))","v":0},{"$f":"IF(ISERROR(VLOOKUP($A77,Paste!$B$5:$T$500,19,FALSE))=TRUE,0,VLOOKUP($A77,Paste!$B$5:$T$500,19,FALSE))","v":0}]
["30107",{"$f":"IF(ISERROR(VLOOKUP($A78,Paste!$B$5:$T$500,4,FALSE))=TRUE,0,VLOOKUP($A78,Paste!$B$5:$T$500,4,FALSE))","v":0},{"$f":"IF(ISERROR(VLOOKUP($A78,Paste!$B$5:$T$500,8,FALSE))=TRUE,0,VLOOKUP($A78,Paste!$B$5:$T$500,8,FALSE))","v":0},{"$f":"IF(ISERROR(VLOOKUP($A78,Paste!$B$5:$T$500,11,FALSE))=TRUE,0,VLOOKUP($A78,Paste!$B$5:$T$500,11,FALSE))","v":0},{"$f":"IF(ISERROR(VLOOKUP($A78,Paste!$B$5:$T$500,16,FALSE))=TRUE,0,VLOOKUP($A78,Paste!$B$5:$T$500,16,FALSE))","v":0},{"$f":"IF(ISERROR(VLOOKUP($A78,Paste!$B$5:$T$500,19,FALSE))=TRUE,0,VLOOKUP($A78,Paste!$B$5:$T$500,19,FALSE))","v":0}]
["30108",{"$f":"IF(ISERROR(VLOOKUP($A79,Paste!$B$5:$T$500,4,FALSE))=TRUE,0,VLOOKUP($A79,Paste!$B$5:$T$500,4,FALSE))","v":0},{"$f":"IF(ISERROR(VLOOKUP($A79,Paste!$B$5:$T$500,8,FALSE))=TRUE,0,VLOOKUP($A79,Paste!$B$5:$T$500,8,FALSE))","v":0},{"$f":"IF(ISERROR(VLOOKUP($A79,Paste!$B$5:$T$500,11,FALSE))=TRUE,0,VLOOKUP($A79,Paste!$B$5:$T$500,11,FALSE))","v":0},{"$f":"IF(ISERROR(VLOOKUP($A79,Paste!$B$5:$T$500,16,FALSE))=TRUE,0,VLOOKUP($A79,Paste!$B$5:$T$500,16,FALSE))","v":0},{"$f":"IF(ISERROR(VLOOKUP($A79,Paste!$B$5:$T$500,19,FALSE))=TRUE,0,VLOOKUP($A79,Paste!$B$5:$T$500,19,FALSE))","v":0}]
["30109",{"$f":"IF(ISERROR(VLOOKUP($A80,Paste!$B$5:$T$500,4,FALSE))=TRUE,0,VLOOKUP($A80,Paste!$B$5:$T$500,4,FALSE))","v":0},{"$f":"IF(ISERROR(VLOOKUP($A80,Paste!$B$5:$T$500,8,FALSE))=TRUE,0,VLOOKUP($A80,Paste!$B$5:$T$500,8,FALSE))","v":0},{"$f":"IF(ISERROR(VLOOKUP($A80,Paste!$B$5:$T$500,11,FALSE))=TRUE,0,VLOOKUP($A80,Paste!$B$5:$T$500,11,FALSE))","v":0},{"$f":"IF(ISERROR(VLOOKUP($A80,Paste!$B$5:$T$500,16,FALSE))=TRUE,0,VLOOKUP($A80,Paste!$B$5:$T$500,16,FALSE))","v":0},{"$f":"IF(ISERROR(VLOOKUP($A80,Paste!$B$5:$T$500,19,FALSE))=TRUE,0,VLOOKUP($A80,Paste!$B$5:$T$500,19,FALSE))","v":0}]
["30110",{"$f":"IF(ISERROR(VLOOKUP($A81,Paste!$B$5:$T$500,4,FALSE))=TRUE,0,VLOOKUP($A81,Paste!$B$5:$T$500,4,FALSE))","v":0},{"$f":"IF(ISERROR(VLOOKUP($A81,Paste!$B$5:$T$500,8,FALSE))=TRUE,0,VLOOKUP($A81,Paste!$B$5:$T$500,8,FALSE))","v":0},{"$f":"IF(ISERROR(VLOOKUP($A81,Paste!$B$5:$T$500,11,FALSE))=TRUE,0,VLOOKUP($A81,Paste!$B$5:$T$500,11,FALSE))","v":0},{"$f":"IF(ISERROR(VLOOKUP($A81,Paste!$B$5:$T$500,16,FALSE))=TRUE,0,VLOOKUP($A81,Paste!$B$5:$T$500,16,FALSE))","v":0},{"$f":"IF(ISERROR(VLOOKUP($A81,Paste!$B$5:$T$500,19,FALSE))=TRUE,0,VLOOKUP($A81,Paste!$B$5:$T$500,19,FALSE))","v":0}]
["30111",{"$f":"IF(ISERROR(VLOOKUP($A82,Paste!$B$5:$T$500,4,FALSE))=TRUE,0,VLOOKUP($A82,Paste!$B$5:$T$500,4,FALSE))","v":0},{"$f":"IF(ISERROR(VLOOKUP($A82,Paste!$B$5:$T$500,8,FALSE))=TRUE,0,VLOOKUP($A82,Paste!$B$5:$T$500,8,FALSE))","v":0},{"$f":"IF(ISERROR(VLOOKUP($A82,Paste!$B$5:$T$500,11,FALSE))=TRUE,0,VLOOKUP($A82,Paste!$B$5:$T$500,11,FALSE))","v":0},{"$f":"IF(ISERROR(VLOOKUP($A82,Paste!$B$5:$T$500,16,FALSE))=TRUE,0,VLOOKUP($A82,Paste!$B$5:$T$500,16,FALSE))","v":0},{"$f":"IF(ISERROR(VLOOKUP($A82,Paste!$B$5:$T$500,19,FALSE))=TRUE,0,VLOOKUP($A82,Paste!$B$5:$T$500,19,FALSE))","v":0}]
["30112",{"$f":"IF(ISERROR(VLOOKUP($A83,Paste!$B$5:$T$500,4,FALSE))=TRUE,0,VLOOKUP($A83,Paste!$B$5:$T$500,4,FALSE))","v":0},{"$f":"IF(ISERROR(VLOOKUP($A83,Paste!$B$5:$T$500,8,FALSE))=TRUE,0,VLOOKUP($A83,Paste!$B$5:$T$500,8,FALSE))","v":0},{"$f":"IF(ISERROR(VLOOKUP($A83,Paste!$B$5:$T$500,11,FALSE))=TRUE,0,VLOOKUP($A83,Paste!$B$5:$T$500,11,FALSE))","v":0},{"$f":"IF(ISERROR(VLOOKUP($A83,Paste!$B$5:$T$500,16,FALSE))=TRUE,0,VLOOKUP($A83,Paste!$B$5:$T$500,16,FALSE))","v":0},{"$f":"IF(ISERROR(VLOOKUP($A83,Paste!$B$5:$T$500,19,FALSE))=TRUE,0,VLOOKUP($A83,Paste!$B$5:$T$500,19,FALSE))","v":0}]
["30113",{"$f":"IF(ISERROR(VLOOKUP($A84,Paste!$B$5:$T$500,4,FALSE))=TRUE,0,VLOOKUP($A84,Paste!$B$5:$T$500,4,FALSE))","v":0},{"$f":"IF(ISERROR(VLOOKUP($A84,Paste!$B$5:$T$500,8,FALSE))=TRUE,0,VLOOKUP($A84,Paste!$B$5:$T$500,8,FALSE))","v":0},{"$f":"IF(ISERROR(VLOOKUP($A84,Paste!$B$5:$T$500,11,FALSE))=TRUE,0,VLOOKUP($A84,Paste!$B$5:$T$500,11,FALSE))","v":0},{"$f":"IF(ISERROR(VLOOKUP($A84,Paste!$B$5:$T$500,16,FALSE))=TRUE,0,VLOOKUP($A84,Paste!$B$5:$T$500,16,FALSE))","v":0},{"$f":"IF(ISERROR(VLOOKUP($A84,Paste!$B$5:$T$500,19,FALSE))=TRUE,0,VLOOKUP($A84,Paste!$B$5:$T$500,19,FALSE))","v":0}]
["30114",{"$f":"IF(ISERROR(VLOOKUP($A85,Paste!$B$5:$T$500,4,FALSE))=TRUE,0,VLOOKUP($A85,Paste!$B$5:$T$500,4,FALSE))","v":0},{"$f":"IF(ISERROR(VLOOKUP($A85,Paste!$B$5:$T$500,8,FALSE))=TRUE,0,VLOOKUP($A85,Paste!$B$5:$T$500,8,FALSE))","v":0},{"$f":"IF(ISERROR(VLOOKUP($A85,Paste!$B$5:$T$500,11,FALSE))=TRUE,0,VLOOKUP($A85,Paste!$B$5:$T$500,11,FALSE))","v":0},{"$f":"IF(ISERROR(VLOOKUP($A85,Paste!$B$5:$T$500,16,FALSE))=TRUE,0,VLOOKUP($A85,Paste!$B$5:$T$500,16,FALSE))","v":0},{"$f":"IF(ISERROR(VLOOKUP($A85,Paste!$B$5:$T$500,19,FALSE))=TRUE,0,VLOOKUP($A85,Paste!$B$5:$T$500,19,FALSE))","v":0}]
["30115",{"$f":"IF(ISERROR(VLOOKUP($A86,Paste!$B$5:$T$500,4,FALSE))=TRUE,0,VLOOKUP($A86,Paste!$B$5:$T$500,4,FALSE))","v":0},{"$f":"IF(ISERROR(VLOOKUP($A86,Paste!$B$5:$T$500,8,FALSE))=TRUE,0,VLOOKUP($A86,Paste!$B$5:$T$500,8,FALSE))","v":0},{"$f":"IF(ISERROR(VLOOKUP($A86,Paste!$B$5:$T$500,11,FALSE))=TRUE,0,VLOOKUP($A86,Paste!$B$5:$T$500,11,FALSE))","v":0},{"$f":"IF(ISERROR(VLOOKUP($A86,Paste!$B$5:$T$500,16,FALSE))=TRUE,0,VLOOKUP($A86,Paste!$B$5:$T$500,16,FALSE))","v":0},{"$f":"IF(ISERROR(VLOOKUP($A86,Paste!$B$5:$T$500,19,FALSE))=TRUE,0,VLOOKUP($A86,Paste!$B$5:$T$500,19,FALSE))","v":0}]
["30116",{"$f":"IF(ISERROR(VLOOKUP($A87,Paste!$B$5:$T$500,4,FALSE))=TRUE,0,VLOOKUP($A87,Paste!$B$5:$T$500,4,FALSE))","v":0},{"$f":"IF(ISERROR(VLOOKUP($A87,Paste!$B$5:$T$500,8,FALSE))=TRUE,0,VLOOKUP($A87,Paste!$B$5:$T$500,8,FALSE))","v":0},{"$f":"IF(ISERROR(VLOOKUP($A87,Paste!$B$5:$T$500,11,FALSE))=TRUE,0,VLOOKUP($A87,Paste!$B$5:$T$500,11,FALSE))","v":0},{"$f":"IF(ISERROR(VLOOKUP($A87,Paste!$B$5:$T$500,16,FALSE))=TRUE,0,VLOOKUP($A87,Paste!$B$5:$T$500,16,FALSE))","v":0},{"$f":"IF(ISERROR(VLOOKUP($A87,Paste!$B$5:$T$500,19,FALSE))=TRUE,0,VLOOKUP($A87,Paste!$B$5:$T$500,19,FALSE))","v":0}]
["30117",{"$f":"IF(ISERROR(VLOOKUP($A88,Paste!$B$5:$T$500,4,FALSE))=TRUE,0,VLOOKUP($A88,Paste!$B$5:$T$500,4,FALSE))","v":0},{"$f":"IF(ISERROR(VLOOKUP($A88,Paste!$B$5:$T$500,8,FALSE))=TRUE,0,VLOOKUP($A88,Paste!$B$5:$T$500,8,FALSE))","v":0},{"$f":"IF(ISERROR(VLOOKUP($A88,Paste!$B$5:$T$500,11,FALSE))=TRUE,0,VLOOKUP($A88,Paste!$B$5:$T$500,11,FALSE))","v":0},{"$f":"IF(ISERROR(VLOOKUP($A88,Paste!$B$5:$T$500,16,FALSE))=TRUE,0,VLOOKUP($A88,Paste!$B$5:$T$500,16,FALSE))","v":0},{"$f":"IF(ISERROR(VLOOKUP($A88,Paste!$B$5:$T$500,19,FALSE))=TRUE,0,VLOOKUP($A88,Paste!$B$5:$T$500,19,FALSE))","v":0}]
["30118",{"$f":"IF(ISERROR(VLOOKUP($A89,Paste!$B$5:$T$500,4,FALSE))=TRUE,0,VLOOKUP($A89,Paste!$B$5:$T$500,4,FALSE))","v":0},{"$f":"IF(ISERROR(VLOOKUP($A89,Paste!$B$5:$T$500,8,FALSE))=TRUE,0,VLOOKUP($A89,Paste!$B$5:$T$500,8,FALSE))","v":0},{"$f":"IF(ISERROR(VLOOKUP($A89,Paste!$B$5:$T$500,11,FALSE))=TRUE,0,VLOOKUP($A89,Paste!$B$5:$T$500,11,FALSE))","v":0},{"$f":"IF(ISERROR(VLOOKUP($A89,Paste!$B$5:$T$500,16,FALSE))=TRUE,0,VLOOKUP($A89,Paste!$B$5:$T$500,16,FALSE))","v":0},{"$f":"IF(ISERROR(VLOOKUP($A89,Paste!$B$5:$T$500,19,FALSE))=TRUE,0,VLOOKUP($A89,Paste!$B$5:$T$500,19,FALSE))","v":0}]
["30119",{"$f":"IF(ISERROR(VLOOKUP($A90,Paste!$B$5:$T$500,4,FALSE))=TRUE,0,VLOOKUP($A90,Paste!$B$5:$T$500,4,FALSE))","v":0},{"$f":"IF(ISERROR(VLOOKUP($A90,Paste!$B$5:$T$500,8,FALSE))=TRUE,0,VLOOKUP($A90,Paste!$B$5:$T$500,8,FALSE))","v":0},{"$f":"IF(ISERROR(VLOOKUP($A90,Paste!$B$5:$T$500,11,FALSE))=TRUE,0,VLOOKUP($A90,Paste!$B$5:$T$500,11,FALSE))","v":0},{"$f":"IF(ISERROR(VLOOKUP($A90,Paste!$B$5:$T$500,16,FALSE))=TRUE,0,VLOOKUP($A90,Paste!$B$5:$T$500,16,FALSE))","v":0},{"$f":"IF(ISERROR(VLOOKUP($A90,Paste!$B$5:$T$500,19,FALSE))=TRUE,0,VLOOKUP($A90,Paste!$B$5:$T$500,19,FALSE))","v":0}]
["30120",{"$f":"IF(ISERROR(VLOOKUP($A91,Paste!$B$5:$T$500,4,FALSE))=TRUE,0,VLOOKUP($A91,Paste!$B$5:$T$500,4,FALSE))","v":0},{"$f":"IF(ISERROR(VLOOKUP($A91,Paste!$B$5:$T$500,8,FALSE))=TRUE,0,VLOOKUP($A91,Paste!$B$5:$T$500,8,FALSE))","v":0},{"$f":"IF(ISERROR(VLOOKUP($A91,Paste!$B$5:$T$500,11,FALSE))=TRUE,0,VLOOKUP($A91,Paste!$B$5:$T$500,11,FALSE))","v":0},{"$f":"IF(ISERROR(VLOOKUP($A91,Paste!$B$5:$T$500,16,FALSE))=TRUE,0,VLOOKUP($A91,Paste!$B$5:$T$500,16,FALSE))","v":0},{"$f":"IF(ISERROR(VLOOKUP($A91,Paste!$B$5:$T$500,19,FALSE))=TRUE,0,VLOOKUP($A91,Paste!$B$5:$T$500,19,FALSE))","v":0}]
["30121",{"$f":"IF(ISERROR(VLOOKUP($A92,Paste!$B$5:$T$500,4,FALSE))=TRUE,0,VLOOKUP($A92,Paste!$B$5:$T$500,4,FALSE))","v":0},{"$f":"IF(ISERROR(VLOOKUP($A92,Paste!$B$5:$T$500,8,FALSE))=TRUE,0,VLOOKUP($A92,Paste!$B$5:$T$500,8,FALSE))","v":0},{"$f":"IF(ISERROR(VLOOKUP($A92,Paste!$B$5:$T$500,11,FALSE))=TRUE,0,VLOOKUP($A92,Paste!$B$5:$T$500,11,FALSE))","v":0},{"$f":"IF(ISERROR(VLOOKUP($A92,Paste!$B$5:$T$500,16,FALSE))=TRUE,0,VLOOKUP($A92,Paste!$B$5:$T$500,16,FALSE))","v":0},{"$f":"IF(ISERROR(VLOOKUP($A92,Paste!$B$5:$T$500,19,FALSE))=TRUE,0,VLOOKUP($A92,Paste!$B$5:$T$500,19,FALSE))","v":0}]
["30126",{"$f":"IF(ISERROR(VLOOKUP($A93,Paste!$B$5:$T$500,4,FALSE))=TRUE,0,VLOOKUP($A93,Paste!$B$5:$T$500,4,FALSE))","v":0},{"$f":"IF(ISERROR(VLOOKUP($A93,Paste!$B$5:$T$500,8,FALSE))=TRUE,0,VLOOKUP($A93,Paste!$B$5:$T$500,8,FALSE))","v":0},{"$f":"IF(ISERROR(VLOOKUP($A93,Paste!$B$5:$T$500,11,FALSE))=TRUE,0,VLOOKUP($A93,Paste!$B$5:$T$500,11,FALSE))","v":0},{"$f":"IF(ISERROR(VLOOKUP($A93,Paste!$B$5:$T$500,16,FALSE))=TRUE,0,VLOOKUP($A93,Paste!$B$5:$T$500,16,FALSE))","v":0},{"$f":"IF(ISERROR(VLOOKUP($A93,Paste!$B$5:$T$500,19,FALSE))=TRUE,0,VLOOKUP($A93,Paste!$B$5:$T$500,19,FALSE))","v":0}]
["30127",{"$f":"IF(ISERROR(VLOOKUP($A94,Paste!$B$5:$T$500,4,FALSE))=TRUE,0,VLOOKUP($A94,Paste!$B$5:$T$500,4,FALSE))","v":0},{"$f":"IF(ISERROR(VLOOKUP($A94,Paste!$B$5:$T$500,8,FALSE))=TRUE,0,VLOOKUP($A94,Paste!$B$5:$T$500,8,FALSE))","v":0},{"$f":"IF(ISERROR(VLOOKUP($A94,Paste!$B$5:$T$500,11,FALSE))=TRUE,0,VLOOKUP($A94,Paste!$B$5:$T$500,11,FALSE))","v":0},{"$f":"IF(ISERROR(VLOOKUP($A94,Paste!$B$5:$T$500,16,FALSE))=TRUE,0,VLOOKUP($A94,Paste!$B$5:$T$500,16,FALSE))","v":0},{"$f":"IF(ISERROR(VLOOKUP($A94,Paste!$B$5:$T$500,19,FALSE))=TRUE,0,VLOOKUP($A94,Paste!$B$5:$T$500,19,FALSE))","v":0}]
["30129",{"$f":"IF(ISERROR(VLOOKUP($A95,Paste!$B$5:$T$500,4,FALSE))=TRUE,0,VLOOKUP($A95,Paste!$B$5:$T$500,4,FALSE))","v":0},{"$f":"IF(ISERROR(VLOOKUP($A95,Paste!$B$5:$T$500,8,FALSE))=TRUE,0,VLOOKUP($A95,Paste!$B$5:$T$500,8,FALSE))","v":0},{"$f":"IF(ISERROR(VLOOKUP($A95,Paste!$B$5:$T$500,11,FALSE))=TRUE,0,VLOOKUP($A95,Paste!$B$5:$T$500,11,FALSE))","v":0},{"$f":"IF(ISERROR(VLOOKUP($A95,Paste!$B$5:$T$500,16,FALSE))=TRUE,0,VLOOKUP($A95,Paste!$B$5:$T$500,16,FALSE))","v":0},{"$f":"IF(ISERROR(VLOOKUP($A95,Paste!$B$5:$T$500,19,FALSE))=TRUE,0,VLOOKUP($A95,Paste!$B$5:$T$500,19,FALSE))","v":0}]
["30188",{"$f":"IF(ISERROR(VLOOKUP($A96,Paste!$B$5:$T$500,4,FALSE))=TRUE,0,VLOOKUP($A96,Paste!$B$5:$T$500,4,FALSE))","v":0},{"$f":"IF(ISERROR(VLOOKUP($A96,Paste!$B$5:$T$500,8,FALSE))=TRUE,0,VLOOKUP($A96,Paste!$B$5:$T$500,8,FALSE))","v":0},{"$f":"IF(ISERROR(VLOOKUP($A96,Paste!$B$5:$T$500,11,FALSE))=TRUE,0,VLOOKUP($A96,Paste!$B$5:$T$500,11,FALSE))","v":0},{"$f":"IF(ISERROR(VLOOKUP($A96,Paste!$B$5:$T$500,16,FALSE))=TRUE,0,VLOOKUP($A96,Paste!$B$5:$T$500,16,FALSE))","v":0},{"$f":"IF(ISERROR(VLOOKUP($A96,Paste!$B$5:$T$500,19,FALSE))=TRUE,0,VLOOKUP($A96,Paste!$B$5:$T$500,19,FALSE))","v":0}]
["30222",{"$f":"IF(ISERROR(VLOOKUP($A97,Paste!$B$5:$T$500,4,FALSE))=TRUE,0,VLOOKUP($A97,Paste!$B$5:$T$500,4,FALSE))","v":0},{"$f":"IF(ISERROR(VLOOKUP($A97,Paste!$B$5:$T$500,8,FALSE))=TRUE,0,VLOOKUP($A97,Paste!$B$5:$T$500,8,FALSE))","v":0},{"$f":"IF(ISERROR(VLOOKUP($A97,Paste!$B$5:$T$500,11,FALSE))=TRUE,0,VLOOKUP($A97,Paste!$B$5:$T$500,11,FALSE))","v":0},{"$f":"IF(ISERROR(VLOOKUP($A97,Paste!$B$5:$T$500,16,FALSE))=TRUE,0,VLOOKUP($A97,Paste!$B$5:$T$500,16,FALSE))","v":0},{"$f":"IF(ISERROR(VLOOKUP($A97,Paste!$B$5:$T$500,19,FALSE))=TRUE,0,VLOOKUP($A97,Paste!$B$5:$T$500,19,FALSE))","v":0}]
["30223",{"$f":"IF(ISERROR(VLOOKUP($A98,Paste!$B$5:$T$500,4,FALSE))=TRUE,0,VLOOKUP($A98,Paste!$B$5:$T$500,4,FALSE))","v":0},{"$f":"IF(ISERROR(VLOOKUP($A98,Paste!$B$5:$T$500,8,FALSE))=TRUE,0,VLOOKUP($A98,Paste!$B$5:$T$500,8,FALSE))","v":0},{"$f":"IF(ISERROR(VLOOKUP($A98,Paste!$B$5:$T$500,11,FALSE))=TRUE,0,VLOOKUP($A98,Paste!$B$5:$T$500,11,FALSE))","v":0},{"$f":"IF(ISERROR(VLOOKUP($A98,Paste!$B$5:$T$500,16,FALSE))=TRUE,0,VLOOKUP($A98,Paste!$B$5:$T$500,16,FALSE))","v":0},{"$f":"IF(ISERROR(VLOOKUP($A98,Paste!$B$5:$T$500,19,FALSE))=TRUE,0,VLOOKUP($A98,Paste!$B$5:$T$500,19,FALSE))","v":0}]
["30224",{"$f":"IF(ISERROR(VLOOKUP($A99,Paste!$B$5:$T$500,4,FALSE))=TRUE,0,VLOOKUP($A99,Paste!$B$5:$T$500,4,FALSE))","v":0},{"$f":"IF(ISERROR(VLOOKUP($A99,Paste!$B$5:$T$500,8,FALSE))=TRUE,0,VLOOKUP($A99,Paste!$B$5:$T$500,8,FALSE))","v":0},{"$f":"IF(ISERROR(VLOOKUP($A99,Paste!$B$5:$T$500,11,FALSE))=TRUE,0,VLOOKUP($A99,Paste!$B$5:$T$500,11,FALSE))","v":0},{"$f":"IF(ISERROR(VLOOKUP($A99,Paste!$B$5:$T$500,16,FALSE))=TRUE,0,VLOOKUP($A99,Paste!$B$5:$T$500,16,FALSE))","v":0},{"$f":"IF(ISERROR(VLOOKUP($A99,Paste!$B$5:$T$500,19,FALSE))=TRUE,0,VLOOKUP($A99,Paste!$B$5:$T$500,19,FALSE))","v":0}]
["30225",{"$f":"IF(ISERROR(VLOOKUP($A100,Paste!$B$5:$T$500,4,FALSE))=TRUE,0,VLOOKUP($A100,Paste!$B$5:$T$500,4,FALSE))","v":0},{"$f":"IF(ISERROR(VLOOKUP($A100,Paste!$B$5:$T$500,8,FALSE))=TRUE,0,VLOOKUP($A100,Paste!$B$5:$T$500,8,FALSE))","v":0},{"$f":"IF(ISERROR(VLOOKUP($A100,Paste!$B$5:$T$500,11,FALSE))=TRUE,0,VLOOKUP($A100,Paste!$B$5:$T$500,11,FALSE))","v":0},{"$f":"IF(ISERROR(VLOOKUP($A100,Paste!$B$5:$T$500,16,FALSE))=TRUE,0,VLOOKUP($A100,Paste!$B$5:$T$500,16,FALSE))","v":0},{"$f":"IF(ISERROR(VLOOKUP($A100,Paste!$B$5:$T$500,19,FALSE))=TRUE,0,VLOOKUP($A100,Paste!$B$5:$T$500,19,FALSE))","v":0}]
["30329",{"$f":"IF(ISERROR(VLOOKUP($A101,Paste!$B$5:$T$500,4,FALSE))=TRUE,0,VLOOKUP($A101,Paste!$B$5:$T$500,4,FALSE))","v":0},{"$f":"IF(ISERROR(VLOOKUP($A101,Paste!$B$5:$T$500,8,FALSE))=TRUE,0,VLOOKUP($A101,Paste!$B$5:$T$500,8,FALSE))","v":0},{"$f":"IF(ISERROR(VLOOKUP($A101,Paste!$B$5:$T$500,11,FALSE))=TRUE,0,VLOOKUP($A101,Paste!$B$5:$T$500,11,FALSE))","v":0},{"$f":"IF(ISERROR(VLOOKUP($A101,Paste!$B$5:$T$500,16,FALSE))=TRUE,0,VLOOKUP($A101,Paste!$B$5:$T$500,16,FALSE))","v":0},{"$f":"IF(ISERROR(VLOOKUP($A101,Paste!$B$5:$T$500,19,FALSE))=TRUE,0,VLOOKUP($A101,Paste!$B$5:$T$500,19,FALSE))","v":0}]
["30401",{"$f":"IF(ISERROR(VLOOKUP($A102,Paste!$B$5:$T$500,4,FALSE))=TRUE,0,VLOOKUP($A102,Paste!$B$5:$T$500,4,FALSE))","v":0},{"$f":"IF(ISERROR(VLOOKUP($A102,Paste!$B$5:$T$500,8,FALSE))=TRUE,0,VLOOKUP($A102,Paste!$B$5:$T$500,8,FALSE))","v":0},{"$f":"IF(ISERROR(VLOOKUP($A102,Paste!$B$5:$T$500,11,FALSE))=TRUE,0,VLOOKUP($A102,Paste!$B$5:$T$500,11,FALSE))","v":0},{"$f":"IF(ISERROR(VLOOKUP($A102,Paste!$B$5:$T$500,16,FALSE))=TRUE,0,VLOOKUP($A102,Paste!$B$5:$T$500,16,FALSE))","v":0},{"$f":"IF(ISERROR(VLOOKUP($A102,Paste!$B$5:$T$500,19,FALSE))=TRUE,0,VLOOKUP($A102,Paste!$B$5:$T$500,19,FALSE))","v":0}]
["30402",{"$f":"IF(ISERROR(VLOOKUP($A103,Paste!$B$5:$T$500,4,FALSE))=TRUE,0,VLOOKUP($A103,Paste!$B$5:$T$500,4,FALSE))","v":0},{"$f":"IF(ISERROR(VLOOKUP($A103,Paste!$B$5:$T$500,8,FALSE))=TRUE,0,VLOOKUP($A103,Paste!$B$5:$T$500,8,FALSE))","v":0},{"$f":"IF(ISERROR(VLOOKUP($A103,Paste!$B$5:$T$500,11,FALSE))=TRUE,0,VLOOKUP($A103,Paste!$B$5:$T$500,11,FALSE))","v":0},{"$f":"IF(ISERROR(VLOOKUP($A103,Paste!$B$5:$T$500,16,FALSE))=TRUE,0,VLOOKUP($A103,Paste!$B$5:$T$500,16,FALSE))","v":0},{"$f":"IF(ISERROR(VLOOKUP($A103,Paste!$B$5:$T$500,19,FALSE))=TRUE,0,VLOOKUP($A103,Paste!$B$5:$T$500,19,FALSE))","v":0}]
["30403",{"$f":"IF(ISERROR(VLOOKUP($A104,Paste!$B$5:$T$500,4,FALSE))=TRUE,0,VLOOKUP($A104,Paste!$B$5:$T$500,4,FALSE))","v":0},{"$f":"IF(ISERROR(VLOOKUP($A104,Paste!$B$5:$T$500,8,FALSE))=TRUE,0,VLOOKUP($A104,Paste!$B$5:$T$500,8,FALSE))","v":0},{"$f":"IF(ISERROR(VLOOKUP($A104,Paste!$B$5:$T$500,11,FALSE))=TRUE,0,VLOOKUP($A104,Paste!$B$5:$T$500,11,FALSE))","v":0},{"$f":"IF(ISERROR(VLOOKUP($A104,Paste!$B$5:$T$500,16,FALSE))=TRUE,0,VLOOKUP($A104,Paste!$B$5:$T$500,16,FALSE))","v":0},{"$f":"IF(ISERROR(VLOOKUP($A104,Paste!$B$5:$T$500,19,FALSE))=TRUE,0,VLOOKUP($A104,Paste!$B$5:$T$500,19,FALSE))","v":0}]
["30404",{"$f":"IF(ISERROR(VLOOKUP($A105,Paste!$B$5:$T$500,4,FALSE))=TRUE,0,VLOOKUP($A105,Paste!$B$5:$T$500,4,FALSE))","v":0},{"$f":"IF(ISERROR(VLOOKUP($A105,Paste!$B$5:$T$500,8,FALSE))=TRUE,0,VLOOKUP($A105,Paste!$B$5:$T$500,8,FALSE))","v":0},{"$f":"IF(ISERROR(VLOOKUP($A105,Paste!$B$5:$T$500,11,FALSE))=TRUE,0,VLOOKUP($A105,Paste!$B$5:$T$500,11,FALSE))","v":0},{"$f":"IF(ISERROR(VLOOKUP($A105,Paste!$B$5:$T$500,16,FALSE))=TRUE,0,VLOOKUP($A105,Paste!$B$5:$T$500,16,FALSE))","v":0},{"$f":"IF(ISERROR(VLOOKUP($A105,Paste!$B$5:$T$500,19,FALSE))=TRUE,0,VLOOKUP($A105,Paste!$B$5:$T$500,19,FALSE))","v":0}]
["30405",{"$f":"IF(ISERROR(VLOOKUP($A106,Paste!$B$5:$T$500,4,FALSE))=TRUE,0,VLOOKUP($A106,Paste!$B$5:$T$500,4,FALSE))","v":0},{"$f":"IF(ISERROR(VLOOKUP($A106,Paste!$B$5:$T$500,8,FALSE))=TRUE,0,VLOOKUP($A106,Paste!$B$5:$T$500,8,FALSE))","v":0},{"$f":"IF(ISERROR(VLOOKUP($A106,Paste!$B$5:$T$500,11,FALSE))=TRUE,0,VLOOKUP($A106,Paste!$B$5:$T$500,11,FALSE))","v":0},{"$f":"IF(ISERROR(VLOOKUP($A106,Paste!$B$5:$T$500,16,FALSE))=TRUE,0,VLOOKUP($A106,Paste!$B$5:$T$500,16,FALSE))","v":0},{"$f":"IF(ISERROR(VLOOKUP($A106,Paste!$B$5:$T$500,19,FALSE))=TRUE,0,VLOOKUP($A106,Paste!$B$5:$T$500,19,FALSE))","v":0}]
["30406",{"$f":"IF(ISERROR(VLOOKUP($A107,Paste!$B$5:$T$500,4,FALSE))=TRUE,0,VLOOKUP($A107,Paste!$B$5:$T$500,4,FALSE))","v":0},{"$f":"IF(ISERROR(VLOOKUP($A107,Paste!$B$5:$T$500,8,FALSE))=TRUE,0,VLOOKUP($A107,Paste!$B$5:$T$500,8,FALSE))","v":0},{"$f":"IF(ISERROR(VLOOKUP($A107,Paste!$B$5:$T$500,11,FALSE))=TRUE,0,VLOOKUP($A107,Paste!$B$5:$T$500,11,FALSE))","v":0},{"$f":"IF(ISERROR(VLOOKUP($A107,Paste!$B$5:$T$500,16,FALSE))=TRUE,0,VLOOKUP($A107,Paste!$B$5:$T$500,16,FALSE))","v":0},{"$f":"IF(ISERROR(VLOOKUP($A107,Paste!$B$5:$T$500,19,FALSE))=TRUE,0,VLOOKUP($A107,Paste!$B$5:$T$500,19,FALSE))","v":0}]
["30407",{"$f":"IF(ISERROR(VLOOKUP($A108,Paste!$B$5:$T$500,4,FALSE))=TRUE,0,VLOOKUP($A108,Paste!$B$5:$T$500,4,FALSE))","v":0},{"$f":"IF(ISERROR(VLOOKUP($A108,Paste!$B$5:$T$500,8,FALSE))=TRUE,0,VLOOKUP($A108,Paste!$B$5:$T$500,8,FALSE))","v":0},{"$f":"IF(ISERROR(VLOOKUP($A108,Paste!$B$5:$T$500,11,FALSE))=TRUE,0,VLOOKUP($A108,Paste!$B$5:$T$500,11,FALSE))","v":0},{"$f":"IF(ISERROR(VLOOKUP($A108,Paste!$B$5:$T$500,16,FALSE))=TRUE,0,VLOOKUP($A108,Paste!$B$5:$T$500,16,FALSE))","v":0},{"$f":"IF(ISERROR(VLOOKUP($A108,Paste!$B$5:$T$500,19,FALSE))=TRUE,0,VLOOKUP($A108,Paste!$B$5:$T$500,19,FALSE))","v":0}]
["30408",{"$f":"IF(ISERROR(VLOOKUP($A109,Paste!$B$5:$T$500,4,FALSE))=TRUE,0,VLOOKUP($A109,Paste!$B$5:$T$500,4,FALSE))","v":0},{"$f":"IF(ISERROR(VLOOKUP($A109,Paste!$B$5:$T$500,8,FALSE))=TRUE,0,VLOOKUP($A109,Paste!$B$5:$T$500,8,FALSE))","v":0},{"$f":"IF(ISERROR(VLOOKUP($A109,Paste!$B$5:$T$500,11,FALSE))=TRUE,0,VLOOKUP($A109,Paste!$B$5:$T$500,11,FALSE))","v":0},{"$f":"IF(ISERROR(VLOOKUP($A109,Paste!$B$5:$T$500,16,FALSE))=TRUE,0,VLOOKUP($A109,Paste!$B$5:$T$500,16,FALSE))","v":0},{"$f":"IF(ISERROR(VLOOKUP($A109,Paste!$B$5:$T$500,19,FALSE))=TRUE,0,VLOOKUP($A109,Paste!$B$5:$T$500,19,FALSE))","v":0}]
["30409",{"$f":"IF(ISERROR(VLOOKUP($A110,Paste!$B$5:$T$500,4,FALSE))=TRUE,0,VLOOKUP($A110,Paste!$B$5:$T$500,4,FALSE))","v":0},{"$f":"IF(ISERROR(VLOOKUP($A110,Paste!$B$5:$T$500,8,FALSE))=TRUE,0,VLOOKUP($A110,Paste!$B$5:$T$500,8,FALSE))","v":0},{"$f":"IF(ISERROR(VLOOKUP($A110,Paste!$B$5:$T$500,11,FALSE))=TRUE,0,VLOOKUP($A110,Paste!$B$5:$T$500,11,FALSE))","v":0},{"$f":"IF(ISERROR(VLOOKUP($A110,Paste!$B$5:$T$500,16,FALSE))=TRUE,0,VLOOKUP($A110,Paste!$B$5:$T$500,16,FALSE))","v":0},{"$f":"IF(ISERROR(VLOOKUP($A110,Paste!$B$5:$T$500,19,FALSE))=TRUE,0,VLOOKUP($A110,Paste!$B$5:$T$500,19,FALSE))","v":0}]
["30410",{"$f":"IF(ISERROR(VLOOKUP($A111,Paste!$B$5:$T$500,4,FALSE))=TRUE,0,VLOOKUP($A111,Paste!$B$5:$T$500,4,FALSE))","v":0},{"$f":"IF(ISERROR(VLOOKUP($A111,Paste!$B$5:$T$500,8,FALSE))=TRUE,0,VLOOKUP($A111,Paste!$B$5:$T$500,8,FALSE))","v":0},{"$f":"IF(ISERROR(VLOOKUP($A111,Paste!$B$5:$T$500,11,FALSE))=TRUE,0,VLOOKUP($A111,Paste!$B$5:$T$500,11,FALSE))","v":0},{"$f":"IF(ISERROR(VLOOKUP($A111,Paste!$B$5:$T$500,16,FALSE))=TRUE,0,VLOOKUP($A111,Paste!$B$5:$T$500,16,FALSE))","v":0},{"$f":"IF(ISERROR(VLOOKUP($A111,Paste!$B$5:$T$500,19,FALSE))=TRUE,0,VLOOKUP($A111,Paste!$B$5:$T$500,19,FALSE))","v":0}]
["30411",{"$f":"IF(ISERROR(VLOOKUP($A112,Paste!$B$5:$T$500,4,FALSE))=TRUE,0,VLOOKUP($A112,Paste!$B$5:$T$500,4,FALSE))","v":0},{"$f":"IF(ISERROR(VLOOKUP($A112,Paste!$B$5:$T$500,8,FALSE))=TRUE,0,VLOOKUP($A112,Paste!$B$5:$T$500,8,FALSE))","v":0},{"$f":"IF(ISERROR(VLOOKUP($A112,Paste!$B$5:$T$500,11,FALSE))=TRUE,0,VLOOKUP($A112,Paste!$B$5:$T$500,11,FALSE))","v":0},{"$f":"IF(ISERROR(VLOOKUP($A112,Paste!$B$5:$T$500,16,FALSE))=TRUE,0,VLOOKUP($A112,Paste!$B$5:$T$500,16,FALSE))","v":0},{"$f":"IF(ISERROR(VLOOKUP($A112,Paste!$B$5:$T$500,19,FALSE))=TRUE,0,VLOOKUP($A112,Paste!$B$5:$T$500,19,FALSE))","v":0}]
["30412",{"$f":"IF(ISERROR(VLOOKUP($A113,Paste!$B$5:$T$500,4,FALSE))=TRUE,0,VLOOKUP($A113,Paste!$B$5:$T$500,4,FALSE))","v":0},{"$f":"IF(ISERROR(VLOOKUP($A113,Paste!$B$5:$T$500,8,FALSE))=TRUE,0,VLOOKUP($A113,Paste!$B$5:$T$500,8,FALSE))","v":0},{"$f":"IF(ISERROR(VLOOKUP($A113,Paste!$B$5:$T$500,11,FALSE))=TRUE,0,VLOOKUP($A113,Paste!$B$5:$T$500,11,FALSE))","v":0},{"$f":"IF(ISERROR(VLOOKUP($A113,Paste!$B$5:$T$500,16,FALSE))=TRUE,0,VLOOKUP($A113,Paste!$B$5:$T$500,16,FALSE))","v":0},{"$f":"IF(ISERROR(VLOOKUP($A113,Paste!$B$5:$T$500,19,FALSE))=TRUE,0,VLOOKUP($A113,Paste!$B$5:$T$500,19,FALSE))","v":0}]
["30413",{"$f":"IF(ISERROR(VLOOKUP($A114,Paste!$B$5:$T$500,4,FALSE))=TRUE,0,VLOOKUP($A114,Paste!$B$5:$T$500,4,FALSE))","v":0},{"$f":"IF(ISERROR(VLOOKUP($A114,Paste!$B$5:$T$500,8,FALSE))=TRUE,0,VLOOKUP($A114,Paste!$B$5:$T$500,8,FALSE))","v":0},{"$f":"IF(ISERROR(VLOOKUP($A114,Paste!$B$5:$T$500,11,FALSE))=TRUE,0,VLOOKUP($A114,Paste!$B$5:$T$500,11,FALSE))","v":0},{"$f":"IF(ISERROR(VLOOKUP($A114,Paste!$B$5:$T$500,16,FALSE))=TRUE,0,VLOOKUP($A114,Paste!$B$5:$T$500,16,FALSE))","v":0},{"$f":"IF(ISERROR(VLOOKUP($A114,Paste!$B$5:$T$500,19,FALSE))=TRUE,0,VLOOKUP($A114,Paste!$B$5:$T$500,19,FALSE))","v":0}]
["30414",{"$f":"IF(ISERROR(VLOOKUP($A115,Paste!$B$5:$T$500,4,FALSE))=TRUE,0,VLOOKUP($A115,Paste!$B$5:$T$500,4,FALSE))","v":0},{"$f":"IF(ISERROR(VLOOKUP($A115,Paste!$B$5:$T$500,8,FALSE))=TRUE,0,VLOOKUP($A115,Paste!$B$5:$T$500,8,FALSE))","v":0},{"$f":"IF(ISERROR(VLOOKUP($A115,Paste!$B$5:$T$500,11,FALSE))=TRUE,0,VLOOKUP($A115,Paste!$B$5:$T$500,11,FALSE))","v":0},{"$f":"IF(ISERROR(VLOOKUP($A115,Paste!$B$5:$T$500,16,FALSE))=TRUE,0,VLOOKUP($A115,Paste!$B$5:$T$500,16,FALSE))","v":0},{"$f":"IF(ISERROR(VLOOKUP($A115,Paste!$B$5:$T$500,19,FALSE))=TRUE,0,VLOOKUP($A115,Paste!$B$5:$T$500,19,FALSE))","v":0}]
["30415",{"$f":"IF(ISERROR(VLOOKUP($A116,Paste!$B$5:$T$500,4,FALSE))=TRUE,0,VLOOKUP($A116,Paste!$B$5:$T$500,4,FALSE))","v":0},{"$f":"IF(ISERROR(VLOOKUP($A116,Paste!$B$5:$T$500,8,FALSE))=TRUE,0,VLOOKUP($A116,Paste!$B$5:$T$500,8,FALSE))","v":0},{"$f":"IF(ISERROR(VLOOKUP($A116,Paste!$B$5:$T$500,11,FALSE))=TRUE,0,VLOOKUP($A116,Paste!$B$5:$T$500,11,FALSE))","v":0},{"$f":"IF(ISERROR(VLOOKUP($A116,Paste!$B$5:$T$500,16,FALSE))=TRUE,0,VLOOKUP($A116,Paste!$B$5:$T$500,16,FALSE))","v":0},{"$f":"IF(ISERROR(VLOOKUP($A116,Paste!$B$5:$T$500,19,FALSE))=TRUE,0,VLOOKUP($A116,Paste!$B$5:$T$500,19,FALSE))","v":0}]
["30416",{"$f":"IF(ISERROR(VLOOKUP($A117,Paste!$B$5:$T$500,4,FALSE))=TRUE,0,VLOOKUP($A117,Paste!$B$5:$T$500,4,FALSE))","v":0},{"$f":"IF(ISERROR(VLOOKUP($A117,Paste!$B$5:$T$500,8,FALSE))=TRUE,0,VLOOKUP($A117,Paste!$B$5:$T$500,8,FALSE))","v":0},{"$f":"IF(ISERROR(VLOOKUP($A117,Paste!$B$5:$T$500,11,FALSE))=TRUE,0,VLOOKUP($A117,Paste!$B$5:$T$500,11,FALSE))","v":0},{"$f":"IF(ISERROR(VLOOKUP($A117,Paste!$B$5:$T$500,16,FALSE))=TRUE,0,VLOOKUP($A117,Paste!$B$5:$T$500,16,FALSE))","v":0},{"$f":"IF(ISERROR(VLOOKUP($A117,Paste!$B$5:$T$500,19,FALSE))=TRUE,0,VLOOKUP($A117,Paste!$B$5:$T$500,19,FALSE))","v":0}]
["30417",{"$f":"IF(ISERROR(VLOOKUP($A118,Paste!$B$5:$T$500,4,FALSE))=TRUE,0,VLOOKUP($A118,Paste!$B$5:$T$500,4,FALSE))","v":0},{"$f":"IF(ISERROR(VLOOKUP($A118,Paste!$B$5:$T$500,8,FALSE))=TRUE,0,VLOOKUP($A118,Paste!$B$5:$T$500,8,FALSE))","v":0},{"$f":"IF(ISERROR(VLOOKUP($A118,Paste!$B$5:$T$500,11,FALSE))=TRUE,0,VLOOKUP($A118,Paste!$B$5:$T$500,11,FALSE))","v":0},{"$f":"IF(ISERROR(VLOOKUP($A118,Paste!$B$5:$T$500,16,FALSE))=TRUE,0,VLOOKUP($A118,Paste!$B$5:$T$500,16,FALSE))","v":0},{"$f":"IF(ISERROR(VLOOKUP($A118,Paste!$B$5:$T$500,19,FALSE))=TRUE,0,VLOOKUP($A118,Paste!$B$5:$T$500,19,FALSE))","v":0}]
["30418",{"$f":"IF(ISERROR(VLOOKUP($A119,Paste!$B$5:$T$500,4,FALSE))=TRUE,0,VLOOKUP($A119,Paste!$B$5:$T$500,4,FALSE))","v":0},{"$f":"IF(ISERROR(VLOOKUP($A119,Paste!$B$5:$T$500,8,FALSE))=TRUE,0,VLOOKUP($A119,Paste!$B$5:$T$500,8,FALSE))","v":0},{"$f":"IF(ISERROR(VLOOKUP($A119,Paste!$B$5:$T$500,11,FALSE))=TRUE,0,VLOOKUP($A119,Paste!$B$5:$T$500,11,FALSE))","v":0},{"$f":"IF(ISERROR(VLOOKUP($A119,Paste!$B$5:$T$500,16,FALSE))=TRUE,0,VLOOKUP($A119,Paste!$B$5:$T$500,16,FALSE))","v":0},{"$f":"IF(ISERROR(VLOOKUP($A119,Paste!$B$5:$T$500,19,FALSE))=TRUE,0,VLOOKUP($A119,Paste!$B$5:$T$500,19,FALSE))","v":0}]
["30419",{"$f":"IF(ISERROR(VLOOKUP($A120,Paste!$B$5:$T$500,4,FALSE))=TRUE,0,VLOOKUP($A120,Paste!$B$5:$T$500,4,FALSE))","v":0},{"$f":"IF(ISERROR(VLOOKUP($A120,Paste!$B$5:$T$500,8,FALSE))=TRUE,0,VLOOKUP($A120,Paste!$B$5:$T$500,8,FALSE))","v":0},{"$f":"IF(ISERROR(VLOOKUP($A120,Paste!$B$5:$T$500,11,FALSE))=TRUE,0,VLOOKUP($A120,Paste!$B$5:$T$500,11,FALSE))","v":0},{"$f":"IF(ISERROR(VLOOKUP($A120,Paste!$B$5:$T$500,16,FALSE))=TRUE,0,VLOOKUP($A120,Paste!$B$5:$T$500,16,FALSE))","v":0},{"$f":"IF(ISERROR(VLOOKUP($A120,Paste!$B$5:$T$500,19,FALSE))=TRUE,0,VLOOKUP($A120,Paste!$B$5:$T$500,19,FALSE))","v":0}]
["30420",{"$f":"IF(ISERROR(VLOOKUP($A121,Paste!$B$5:$T$500,4,FALSE))=TRUE,0,VLOOKUP($A121,Paste!$B$5:$T$500,4,FALSE))","v":0},{"$f":"IF(ISERROR(VLOOKUP($A121,Paste!$B$5:$T$500,8,FALSE))=TRUE,0,VLOOKUP($A121,Paste!$B$5:$T$500,8,FALSE))","v":0},{"$f":"IF(ISERROR(VLOOKUP($A121,Paste!$B$5:$T$500,11,FALSE))=TRUE,0,VLOOKUP($A121,Paste!$B$5:$T$500,11,FALSE))","v":0},{"$f":"IF(ISERROR(VLOOKUP($A121,Paste!$B$5:$T$500,16,FALSE))=TRUE,0,VLOOKUP($A121,Paste!$B$5:$T$500,16,FALSE))","v":0},{"$f":"IF(ISERROR(VLOOKUP($A121,Paste!$B$5:$T$500,19,FALSE))=TRUE,0,VLOOKUP($A121,Paste!$B$5:$T$500,19,FALSE))","v":0}]
["30421",{"$f":"IF(ISERROR(VLOOKUP($A122,Paste!$B$5:$T$500,4,FALSE))=TRUE,0,VLOOKUP($A122,Paste!$B$5:$T$500,4,FALSE))","v":0},{"$f":"IF(ISERROR(VLOOKUP($A122,Paste!$B$5:$T$500,8,FALSE))=TRUE,0,VLOOKUP($A122,Paste!$B$5:$T$500,8,FALSE))","v":0},{"$f":"IF(ISERROR(VLOOKUP($A122,Paste!$B$5:$T$500,11,FALSE))=TRUE,0,VLOOKUP($A122,Paste!$B$5:$T$500,11,FALSE))","v":0},{"$f":"IF(ISERROR(VLOOKUP($A122,Paste!$B$5:$T$500,16,FALSE))=TRUE,0,VLOOKUP($A122,Paste!$B$5:$T$500,16,FALSE))","v":0},{"$f":"IF(ISERROR(VLOOKUP($A122,Paste!$B$5:$T$500,19,FALSE))=TRUE,0,VLOOKUP($A122,Paste!$B$5:$T$500,19,FALSE))","v":0}]
["30422",{"$f":"IF(ISERROR(VLOOKUP($A123,Paste!$B$5:$T$500,4,FALSE))=TRUE,0,VLOOKUP($A123,Paste!$B$5:$T$500,4,FALSE))","v":0},{"$f":"IF(ISERROR(VLOOKUP($A123,Paste!$B$5:$T$500,8,FALSE))=TRUE,0,VLOOKUP($A123,Paste!$B$5:$T$500,8,FALSE))","v":0},{"$f":"IF(ISERROR(VLOOKUP($A123,Paste!$B$5:$T$500,11,FALSE))=TRUE,0,VLOOKUP($A123,Paste!$B$5:$T$500,11,FALSE))","v":0},{"$f":"IF(ISERROR(VLOOKUP($A123,Paste!$B$5:$T$500,16,FALSE))=TRUE,0,VLOOKUP($A123,Paste!$B$5:$T$500,16,FALSE))","v":0},{"$f":"IF(ISERROR(VLOOKUP($A123,Paste!$B$5:$T$500,19,FALSE))=TRUE,0,VLOOKUP($A123,Paste!$B$5:$T$500,19,FALSE))","v":0}]
["30423",{"$f":"IF(ISERROR(VLOOKUP($A124,Paste!$B$5:$T$500,4,FALSE))=TRUE,0,VLOOKUP($A124,Paste!$B$5:$T$500,4,FALSE))","v":0},{"$f":"IF(ISERROR(VLOOKUP($A124,Paste!$B$5:$T$500,8,FALSE))=TRUE,0,VLOOKUP($A124,Paste!$B$5:$T$500,8,FALSE))","v":0},{"$f":"IF(ISERROR(VLOOKUP($A124,Paste!$B$5:$T$500,11,FALSE))=TRUE,0,VLOOKUP($A124,Paste!$B$5:$T$500,11,FALSE))","v":0},{"$f":"IF(ISERROR(VLOOKUP($A124,Paste!$B$5:$T$500,16,FALSE))=TRUE,0,VLOOKUP($A124,Paste!$B$5:$T$500,16,FALSE))","v":0},{"$f":"IF(ISERROR(VLOOKUP($A124,Paste!$B$5:$T$500,19,FALSE))=TRUE,0,VLOOKUP($A124,Paste!$B$5:$T$500,19,FALSE))","v":0}]
["30424",{"$f":"IF(ISERROR(VLOOKUP($A125,Paste!$B$5:$T$500,4,FALSE))=TRUE,0,VLOOKUP($A125,Paste!$B$5:$T$500,4,FALSE))","v":0},{"$f":"IF(ISERROR(VLOOKUP($A125,Paste!$B$5:$T$500,8,FALSE))=TRUE,0,VLOOKUP($A125,Paste!$B$5:$T$500,8,FALSE))","v":0},{"$f":"IF(ISERROR(VLOOKUP($A125,Paste!$B$5:$T$500,11,FALSE))=TRUE,0,VLOOKUP($A125,Paste!$B$5:$T$500,11,FALSE))","v":0},{"$f":"IF(ISERROR(VLOOKUP($A125,Paste!$B$5:$T$500,16,FALSE))=TRUE,0,VLOOKUP($A125,Paste!$B$5:$T$500,16,FALSE))","v":0},{"$f":"IF(ISERROR(VLOOKUP($A125,Paste!$B$5:$T$500,19,FALSE))=TRUE,0,VLOOKUP($A125,Paste!$B$5:$T$500,19,FALSE))","v":0}]
["30425",{"$f":"IF(ISERROR(VLOOKUP($A126,Paste!$B$5:$T$500,4,FALSE))=TRUE,0,VLOOKUP($A126,Paste!$B$5:$T$500,4,FALSE))","v":0},{"$f":"IF(ISERROR(VLOOKUP($A126,Paste!$B$5:$T$500,8,FALSE))=TRUE,0,VLOOKUP($A126,Paste!$B$5:$T$500,8,FALSE))","v":0},{"$f":"IF(ISERROR(VLOOKUP($A126,Paste!$B$5:$T$500,11,FALSE))=TRUE,0,VLOOKUP($A126,Paste!$B$5:$T$500,11,FALSE))","v":0},{"$f":"IF(ISERROR(VLOOKUP($A126,Paste!$B$5:$T$500,16,FALSE))=TRUE,0,VLOOKUP($A126,Paste!$B$5:$T$500,16,FALSE))","v":0},{"$f":"IF(ISERROR(VLOOKUP($A126,Paste!$B$5:$T$500,19,FALSE))=TRUE,0,VLOOKUP($A126,Paste!$B$5:$T$500,19,FALSE))","v":0}]
["30426",{"$f":"IF(ISERROR(VLOOKUP($A127,Paste!$B$5:$T$500,4,FALSE))=TRUE,0,VLOOKUP($A127,Paste!$B$5:$T$500,4,FALSE))","v":0},{"$f":"IF(ISERROR(VLOOKUP($A127,Paste!$B$5:$T$500,8,FALSE))=TRUE,0,VLOOKUP($A127,Paste!$B$5:$T$500,8,FALSE))","v":0},{"$f":"IF(ISERROR(VLOOKUP($A127,Paste!$B$5:$T$500,11,FALSE))=TRUE,0,VLOOKUP($A127,Paste!$B$5:$T$500,11,FALSE))","v":0},{"$f":"IF(ISERROR(VLOOKUP($A127,Paste!$B$5:$T$500,16,FALSE))=TRUE,0,VLOOKUP($A127,Paste!$B$5:$T$500,16,FALSE))","v":0},{"$f":"IF(ISERROR(VLOOKUP($A127,Paste!$B$5:$T$500,19,FALSE))=TRUE,0,VLOOKUP($A127,Paste!$B$5:$T$500,19,FALSE))","v":0}]
["30427",{"$f":"IF(ISERROR(VLOOKUP($A128,Paste!$B$5:$T$500,4,FALSE))=TRUE,0,VLOOKUP($A128,Paste!$B$5:$T$500,4,FALSE))","v":0},{"$f":"IF(ISERROR(VLOOKUP($A128,Paste!$B$5:$T$500,8,FALSE))=TRUE,0,VLOOKUP($A128,Paste!$B$5:$T$500,8,FALSE))","v":0},{"$f":"IF(ISERROR(VLOOKUP($A128,Paste!$B$5:$T$500,11,FALSE))=TRUE,0,VLOOKUP($A128,Paste!$B$5:$T$500,11,FALSE))","v":0},{"$f":"IF(ISERROR(VLOOKUP($A128,Paste!$B$5:$T$500,16,FALSE))=TRUE,0,VLOOKUP($A128,Paste!$B$5:$T$500,16,FALSE))","v":0},{"$f":"IF(ISERROR(VLOOKUP($A128,Paste!$B$5:$T$500,19,FALSE))=TRUE,0,VLOOKUP($A128,Paste!$B$5:$T$500,19,FALSE))","v":0}]
["30428",{"$f":"IF(ISERROR(VLOOKUP($A129,Paste!$B$5:$T$500,4,FALSE))=TRUE,0,VLOOKUP($A129,Paste!$B$5:$T$500,4,FALSE))","v":0},{"$f":"IF(ISERROR(VLOOKUP($A129,Paste!$B$5:$T$500,8,FALSE))=TRUE,0,VLOOKUP($A129,Paste!$B$5:$T$500,8,FALSE))","v":0},{"$f":"IF(ISERROR(VLOOKUP($A129,Paste!$B$5:$T$500,11,FALSE))=TRUE,0,VLOOKUP($A129,Paste!$B$5:$T$500,11,FALSE))","v":0},{"$f":"IF(ISERROR(VLOOKUP($A129,Paste!$B$5:$T$500,16,FALSE))=TRUE,0,VLOOKUP($A129,Paste!$B$5:$T$500,16,FALSE))","v":0},{"$f":"IF(ISERROR(VLOOKUP($A129,Paste!$B$5:$T$500,19,FALSE))=TRUE,0,VLOOKUP($A129,Paste!$B$5:$T$500,19,FALSE))","v":0}]
["30429",{"$f":"IF(ISERROR(VLOOKUP($A130,Paste!$B$5:$T$500,4,FALSE))=TRUE,0,VLOOKUP($A130,Paste!$B$5:$T$500,4,FALSE))","v":0},{"$f":"IF(ISERROR(VLOOKUP($A130,Paste!$B$5:$T$500,8,FALSE))=TRUE,0,VLOOKUP($A130,Paste!$B$5:$T$500,8,FALSE))","v":0},{"$f":"IF(ISERROR(VLOOKUP($A130,Paste!$B$5:$T$500,11,FALSE))=TRUE,0,VLOOKUP($A130,Paste!$B$5:$T$500,11,FALSE))","v":0},{"$f":"IF(ISERROR(VLOOKUP($A130,Paste!$B$5:$T$500,16,FALSE))=TRUE,0,VLOOKUP($A130,Paste!$B$5:$T$500,16,FALSE))","v":0},{"$f":"IF(ISERROR(VLOOKUP($A130,Paste!$B$5:$T$500,19,FALSE))=TRUE,0,VLOOKUP($A130,Paste!$B$5:$T$500,19,FALSE))","v":0}]
["30488",{"$f":"IF(ISERROR(VLOOKUP($A131,Paste!$B$5:$T$500,4,FALSE))=TRUE,0,VLOOKUP($A131,Paste!$B$5:$T$500,4,FALSE))","v":0},{"$f":"IF(ISERROR(VLOOKUP($A131,Paste!$B$5:$T$500,8,FALSE))=TRUE,0,VLOOKUP($A131,Paste!$B$5:$T$500,8,FALSE))","v":0},{"$f":"IF(ISERROR(VLOOKUP($A131,Paste!$B$5:$T$500,11,FALSE))=TRUE,0,VLOOKUP($A131,Paste!$B$5:$T$500,11,FALSE))","v":0},{"$f":"IF(ISERROR(VLOOKUP($A131,Paste!$B$5:$T$500,16,FALSE))=TRUE,0,VLOOKUP($A131,Paste!$B$5:$T$500,16,FALSE))","v":0},{"$f":"IF(ISERROR(VLOOKUP($A131,Paste!$B$5:$T$500,19,FALSE))=TRUE,0,VLOOKUP($A131,Paste!$B$5:$T$500,19,FALSE))","v":0}]
["39901",{"$f":"IF(ISERROR(VLOOKUP($A132,Paste!$B$5:$T$500,4,FALSE))=TRUE,0,VLOOKUP($A132,Paste!$B$5:$T$500,4,FALSE))","v":0},{"$f":"IF(ISERROR(VLOOKUP($A132,Paste!$B$5:$T$500,8,FALSE))=TRUE,0,VLOOKUP($A132,Paste!$B$5:$T$500,8,FALSE))","v":0},{"$f":"IF(ISERROR(VLOOKUP($A132,Paste!$B$5:$T$500,11,FALSE))=TRUE,0,VLOOKUP($A132,Paste!$B$5:$T$500,11,FALSE))","v":0},{"$f":"IF(ISERROR(VLOOKUP($A132,Paste!$B$5:$T$500,16,FALSE))=TRUE,0,VLOOKUP($A132,Paste!$B$5:$T$500,16,FALSE))","v":0},{"$f":"IF(ISERROR(VLOOKUP($A132,Paste!$B$5:$T$500,19,FALSE))=TRUE,0,VLOOKUP($A132,Paste!$B$5:$T$500,19,FALSE))","v":0}]
["39902",{"$f":"IF(ISERROR(VLOOKUP($A133,Paste!$B$5:$T$500,4,FALSE))=TRUE,0,VLOOKUP($A133,Paste!$B$5:$T$500,4,FALSE))","v":0},{"$f":"IF(ISERROR(VLOOKUP($A133,Paste!$B$5:$T$500,8,FALSE))=TRUE,0,VLOOKUP($A133,Paste!$B$5:$T$500,8,FALSE))","v":0},{"$f":"IF(ISERROR(VLOOKUP($A133,Paste!$B$5:$T$500,11,FALSE))=TRUE,0,VLOOKUP($A133,Paste!$B$5:$T$500,11,FALSE))","v":0},{"$f":"IF(ISERROR(VLOOKUP($A133,Paste!$B$5:$T$500,16,FALSE))=TRUE,0,VLOOKUP($A133,Paste!$B$5:$T$500,16,FALSE))","v":0},{"$f":"IF(ISERROR(VLOOKUP($A133,Paste!$B$5:$T$500,19,FALSE))=TRUE,0,VLOOKUP($A133,Paste!$B$5:$T$500,19,FALSE))","v":0}]
["39903",{"$f":"IF(ISERROR(VLOOKUP($A134,Paste!$B$5:$T$500,4,FALSE))=TRUE,0,VLOOKUP($A134,Paste!$B$5:$T$500,4,FALSE))","v":0},{"$f":"IF(ISERROR(VLOOKUP($A134,Paste!$B$5:$T$500,8,FALSE))=TRUE,0,VLOOKUP($A134,Paste!$B$5:$T$500,8,FALSE))","v":0},{"$f":"IF(ISERROR(VLOOKUP($A134,Paste!$B$5:$T$500,11,FALSE))=TRUE,0,VLOOKUP($A134,Paste!$B$5:$T$500,11,FALSE))","v":0},{"$f":"IF(ISERROR(VLOOKUP($A134,Paste!$B$5:$T$500,16,FALSE))=TRUE,0,VLOOKUP($A134,Paste!$B$5:$T$500,16,FALSE))","v":0},{"$f":"IF(ISERROR(VLOOKUP($A134,Paste!$B$5:$T$500,19,FALSE))=TRUE,0,VLOOKUP($A134,Paste!$B$5:$T$500,19,FALSE))","v":0}]
["39904",{"$f":"IF(ISERROR(VLOOKUP($A135,Paste!$B$5:$T$500,4,FALSE))=TRUE,0,VLOOKUP($A135,Paste!$B$5:$T$500,4,FALSE))","v":0},{"$f":"IF(ISERROR(VLOOKUP($A135,Paste!$B$5:$T$500,8,FALSE))=TRUE,0,VLOOKUP($A135,Paste!$B$5:$T$500,8,FALSE))","v":0},{"$f":"IF(ISERROR(VLOOKUP($A135,Paste!$B$5:$T$500,11,FALSE))=TRUE,0,VLOOKUP($A135,Paste!$B$5:$T$500,11,FALSE))","v":0},{"$f":"IF(ISERROR(VLOOKUP($A135,Paste!$B$5:$T$500,16,FALSE))=TRUE,0,VLOOKUP($A135,Paste!$B$5:$T$500,16,FALSE))","v":0},{"$f":"IF(ISERROR(VLOOKUP($A135,Paste!$B$5:$T$500,19,FALSE))=TRUE,0,VLOOKUP($A135,Paste!$B$5:$T$500,19,FALSE))","v":0}]
["39905",{"$f":"IF(ISERROR(VLOOKUP($A136,Paste!$B$5:$T$500,4,FALSE))=TRUE,0,VLOOKUP($A136,Paste!$B$5:$T$500,4,FALSE))","v":0},{"$f":"IF(ISERROR(VLOOKUP($A136,Paste!$B$5:$T$500,8,FALSE))=TRUE,0,VLOOKUP($A136,Paste!$B$5:$T$500,8,FALSE))","v":0},{"$f":"IF(ISERROR(VLOOKUP($A136,Paste!$B$5:$T$500,11,FALSE))=TRUE,0,VLOOKUP($A136,Paste!$B$5:$T$500,11,FALSE))","v":0},{"$f":"IF(ISERROR(VLOOKUP($A136,Paste!$B$5:$T$500,16,FALSE))=TRUE,0,VLOOKUP($A136,Paste!$B$5:$T$500,16,FALSE))","v":0},{"$f":"IF(ISERROR(VLOOKUP($A136,Paste!$B$5:$T$500,19,FALSE))=TRUE,0,VLOOKUP($A136,Paste!$B$5:$T$500,19,FALSE))","v":0}]
["39906",{"$f":"IF(ISERROR(VLOOKUP($A137,Paste!$B$5:$T$500,4,FALSE))=TRUE,0,VLOOKUP($A137,Paste!$B$5:$T$500,4,FALSE))","v":0},{"$f":"IF(ISERROR(VLOOKUP($A137,Paste!$B$5:$T$500,8,FALSE))=TRUE,0,VLOOKUP($A137,Paste!$B$5:$T$500,8,FALSE))","v":0},{"$f":"IF(ISERROR(VLOOKUP($A137,Paste!$B$5:$T$500,11,FALSE))=TRUE,0,VLOOKUP($A137,Paste!$B$5:$T$500,11,FALSE))","v":0},{"$f":"IF(ISERROR(VLOOKUP($A137,Paste!$B$5:$T$500,16,FALSE))=TRUE,0,VLOOKUP($A137,Paste!$B$5:$T$500,16,FALSE))","v":0},{"$f":"IF(ISERROR(VLOOKUP($A137,Paste!$B$5:$T$500,19,FALSE))=TRUE,0,VLOOKUP($A137,Paste!$B$5:$T$500,19,FALSE))","v":0}]
["39907",{"$f":"IF(ISERROR(VLOOKUP($A138,Paste!$B$5:$T$500,4,FALSE))=TRUE,0,VLOOKUP($A138,Paste!$B$5:$T$500,4,FALSE))","v":0},{"$f":"IF(ISERROR(VLOOKUP($A138,Paste!$B$5:$T$500,8,FALSE))=TRUE,0,VLOOKUP($A138,Paste!$B$5:$T$500,8,FALSE))","v":0},{"$f":"IF(ISERROR(VLOOKUP($A138,Paste!$B$5:$T$500,11,FALSE))=TRUE,0,VLOOKUP($A138,Paste!$B$5:$T$500,11,FALSE))","v":0},{"$f":"IF(ISERROR(VLOOKUP($A138,Paste!$B$5:$T$500,16,FALSE))=TRUE,0,VLOOKUP($A138,Paste!$B$5:$T$500,16,FALSE))","v":0},{"$f":"IF(ISERROR(VLOOKUP($A138,Paste!$B$5:$T$500,19,FALSE))=TRUE,0,VLOOKUP($A138,Paste!$B$5:$T$500,19,FALSE))","v":0}]
["39908",{"$f":"IF(ISERROR(VLOOKUP($A139,Paste!$B$5:$T$500,4,FALSE))=TRUE,0,VLOOKUP($A139,Paste!$B$5:$T$500,4,FALSE))","v":0},{"$f":"IF(ISERROR(VLOOKUP($A139,Paste!$B$5:$T$500,8,FALSE))=TRUE,0,VLOOKUP($A139,Paste!$B$5:$T$500,8,FALSE))","v":0},{"$f":"IF(ISERROR(VLOOKUP($A139,Paste!$B$5:$T$500,11,FALSE))=TRUE,0,VLOOKUP($A139,Paste!$B$5:$T$500,11,FALSE))","v":0},{"$f":"IF(ISERROR(VLOOKUP($A139,Paste!$B$5:$T$500,16,FALSE))=TRUE,0,VLOOKUP($A139,Paste!$B$5:$T$500,16,FALSE))","v":0},{"$f":"IF(ISERROR(VLOOKUP($A139,Paste!$B$5:$T$500,19,FALSE))=TRUE,0,VLOOKUP($A139,Paste!$B$5:$T$500,19,FALSE))","v":0}]
["39909",{"$f":"IF(ISERROR(VLOOKUP($A140,Paste!$B$5:$T$500,4,FALSE))=TRUE,0,VLOOKUP($A140,Paste!$B$5:$T$500,4,FALSE))","v":0},{"$f":"IF(ISERROR(VLOOKUP($A140,Paste!$B$5:$T$500,8,FALSE))=TRUE,0,VLOOKUP($A140,Paste!$B$5:$T$500,8,FALSE))","v":0},{"$f":"IF(ISERROR(VLOOKUP($A140,Paste!$B$5:$T$500,11,FALSE))=TRUE,0,VLOOKUP($A140,Paste!$B$5:$T$500,11,FALSE))","v":0},{"$f":"IF(ISERROR(VLOOKUP($A140,Paste!$B$5:$T$500,16,FALSE))=TRUE,0,VLOOKUP($A140,Paste!$B$5:$T$500,16,FALSE))","v":0},{"$f":"IF(ISERROR(VLOOKUP($A140,Paste!$B$5:$T$500,19,FALSE))=TRUE,0,VLOOKUP($A140,Paste!$B$5:$T$500,19,FALSE))","v":0}]
["39910",{"$f":"IF(ISERROR(VLOOKUP($A141,Paste!$B$5:$T$500,4,FALSE))=TRUE,0,VLOOKUP($A141,Paste!$B$5:$T$500,4,FALSE))","v":0},{"$f":"IF(ISERROR(VLOOKUP($A141,Paste!$B$5:$T$500,8,FALSE))=TRUE,0,VLOOKUP($A141,Paste!$B$5:$T$500,8,FALSE))","v":0},{"$f":"IF(ISERROR(VLOOKUP($A141,Paste!$B$5:$T$500,11,FALSE))=TRUE,0,VLOOKUP($A141,Paste!$B$5:$T$500,11,FALSE))","v":0},{"$f":"IF(ISERROR(VLOOKUP($A141,Paste!$B$5:$T$500,16,FALSE))=TRUE,0,VLOOKUP($A141,Paste!$B$5:$T$500,16,FALSE))","v":0},{"$f":"IF(ISERROR(VLOOKUP($A141,Paste!$B$5:$T$500,19,FALSE))=TRUE,0,VLOOKUP($A141,Paste!$B$5:$T$500,19,FALSE))","v":0}]
["39911",{"$f":"IF(ISERROR(VLOOKUP($A142,Paste!$B$5:$T$500,4,FALSE))=TRUE,0,VLOOKUP($A142,Paste!$B$5:$T$500,4,FALSE))","v":0},{"$f":"IF(ISERROR(VLOOKUP($A142,Paste!$B$5:$T$500,8,FALSE))=TRUE,0,VLOOKUP($A142,Paste!$B$5:$T$500,8,FALSE))","v":0},{"$f":"IF(ISERROR(VLOOKUP($A142,Paste!$B$5:$T$500,11,FALSE))=TRUE,0,VLOOKUP($A142,Paste!$B$5:$T$500,11,FALSE))","v":0},{"$f":"IF(ISERROR(VLOOKUP($A142,Paste!$B$5:$T$500,16,FALSE))=TRUE,0,VLOOKUP($A142,Paste!$B$5:$T$500,16,FALSE))","v":0},{"$f":"IF(ISERROR(VLOOKUP($A142,Paste!$B$5:$T$500,19,FALSE))=TRUE,0,VLOOKUP($A142,Paste!$B$5:$T$500,19,FALSE))","v":0}]
["39912",{"$f":"IF(ISERROR(VLOOKUP($A143,Paste!$B$5:$T$500,4,FALSE))=TRUE,0,VLOOKUP($A143,Paste!$B$5:$T$500,4,FALSE))","v":0},{"$f":"IF(ISERROR(VLOOKUP($A143,Paste!$B$5:$T$500,8,FALSE))=TRUE,0,VLOOKUP($A143,Paste!$B$5:$T$500,8,FALSE))","v":0},{"$f":"IF(ISERROR(VLOOKUP($A143,Paste!$B$5:$T$500,11,FALSE))=TRUE,0,VLOOKUP($A143,Paste!$B$5:$T$500,11,FALSE))","v":0},{"$f":"IF(ISERROR(VLOOKUP($A143,Paste!$B$5:$T$500,16,FALSE))=TRUE,0,VLOOKUP($A143,Paste!$B$5:$T$500,16,FALSE))","v":0},{"$f":"IF(ISERROR(VLOOKUP($A143,Paste!$B$5:$T$500,19,FALSE))=TRUE,0,VLOOKUP($A143,Paste!$B$5:$T$500,19,FALSE))","v":0}]
["39913",{"$f":"IF(ISERROR(VLOOKUP($A144,Paste!$B$5:$T$500,4,FALSE))=TRUE,0,VLOOKUP($A144,Paste!$B$5:$T$500,4,FALSE))","v":0},{"$f":"IF(ISERROR(VLOOKUP($A144,Paste!$B$5:$T$500,8,FALSE))=TRUE,0,VLOOKUP($A144,Paste!$B$5:$T$500,8,FALSE))","v":0},{"$f":"IF(ISERROR(VLOOKUP($A144,Paste!$B$5:$T$500,11,FALSE))=TRUE,0,VLOOKUP($A144,Paste!$B$5:$T$500,11,FALSE))","v":0},{"$f":"IF(ISERROR(VLOOKUP($A144,Paste!$B$5:$T$500,16,FALSE))=TRUE,0,VLOOKUP($A144,Paste!$B$5:$T$500,16,FALSE))","v":0},{"$f":"IF(ISERROR(VLOOKUP($A144,Paste!$B$5:$T$500,19,FALSE))=TRUE,0,VLOOKUP($A144,Paste!$B$5:$T$500,19,FALSE))","v":0}]
["39914",{"$f":"IF(ISERROR(VLOOKUP($A145,Paste!$B$5:$T$500,4,FALSE))=TRUE,0,VLOOKUP($A145,Paste!$B$5:$T$500,4,FALSE))","v":0},{"$f":"IF(ISERROR(VLOOKUP($A145,Paste!$B$5:$T$500,8,FALSE))=TRUE,0,VLOOKUP($A145,Paste!$B$5:$T$500,8,FALSE))","v":0},{"$f":"IF(ISERROR(VLOOKUP($A145,Paste!$B$5:$T$500,11,FALSE))=TRUE,0,VLOOKUP($A145,Paste!$B$5:$T$500,11,FALSE))","v":0},{"$f":"IF(ISERROR(VLOOKUP($A145,Paste!$B$5:$T$500,16,FALSE))=TRUE,0,VLOOKUP($A145,Paste!$B$5:$T$500,16,FALSE))","v":0},{"$f":"IF(ISERROR(VLOOKUP($A145,Paste!$B$5:$T$500,19,FALSE))=TRUE,0,VLOOKUP($A145,Paste!$B$5:$T$500,19,FALSE))","v":0}]
["39915",{"$f":"IF(ISERROR(VLOOKUP($A146,Paste!$B$5:$T$500,4,FALSE))=TRUE,0,VLOOKUP($A146,Paste!$B$5:$T$500,4,FALSE))","v":0},{"$f":"IF(ISERROR(VLOOKUP($A146,Paste!$B$5:$T$500,8,FALSE))=TRUE,0,VLOOKUP($A146,Paste!$B$5:$T$500,8,FALSE))","v":0},{"$f":"IF(ISERROR(VLOOKUP($A146,Paste!$B$5:$T$500,11,FALSE))=TRUE,0,VLOOKUP($A146,Paste!$B$5:$T$500,11,FALSE))","v":0},{"$f":"IF(ISERROR(VLOOKUP($A146,Paste!$B$5:$T$500,16,FALSE))=TRUE,0,VLOOKUP($A146,Paste!$B$5:$T$500,16,FALSE))","v":0},{"$f":"IF(ISERROR(VLOOKUP($A146,Paste!$B$5:$T$500,19,FALSE))=TRUE,0,VLOOKUP($A146,Paste!$B$5:$T$500,19,FALSE))","v":0}]
["39916",{"$f":"IF(ISERROR(VLOOKUP($A147,Paste!$B$5:$T$500,4,FALSE))=TRUE,0,VLOOKUP($A147,Paste!$B$5:$T$500,4,FALSE))","v":0},{"$f":"IF(ISERROR(VLOOKUP($A147,Paste!$B$5:$T$500,8,FALSE))=TRUE,0,VLOOKUP($A147,Paste!$B$5:$T$500,8,FALSE))","v":0},{"$f":"IF(ISERROR(VLOOKUP($A147,Paste!$B$5:$T$500,11,FALSE))=TRUE,0,VLOOKUP($A147,Paste!$B$5:$T$500,11,FALSE))","v":0},{"$f":"IF(ISERROR(VLOOKUP($A147,Paste!$B$5:$T$500,16,FALSE))=TRUE,0,VLOOKUP($A147,Paste!$B$5:$T$500,16,FALSE))","v":0},{"$f":"IF(ISERROR(VLOOKUP($A147,Paste!$B$5:$T$500,19,FALSE))=TRUE,0,VLOOKUP($A147,Paste!$B$5:$T$500,19,FALSE))","v":0}]
["39917",{"$f":"IF(ISERROR(VLOOKUP($A148,Paste!$B$5:$T$500,4,FALSE))=TRUE,0,VLOOKUP($A148,Paste!$B$5:$T$500,4,FALSE))","v":0},{"$f":"IF(ISERROR(VLOOKUP($A148,Paste!$B$5:$T$500,8,FALSE))=TRUE,0,VLOOKUP($A148,Paste!$B$5:$T$500,8,FALSE))","v":0},{"$f":"IF(ISERROR(VLOOKUP($A148,Paste!$B$5:$T$500,11,FALSE))=TRUE,0,VLOOKUP($A148,Paste!$B$5:$T$500,11,FALSE))","v":0},{"$f":"IF(ISERROR(VLOOKUP($A148,Paste!$B$5:$T$500,16,FALSE))=TRUE,0,VLOOKUP($A148,Paste!$B$5:$T$500,16,FALSE))","v":0},{"$f":"IF(ISERROR(VLOOKUP($A148,Paste!$B$5:$T$500,19,FALSE))=TRUE,0,VLOOKUP($A148,Paste!$B$5:$T$500,19,FALSE))","v":0}]
["39918",{"$f":"IF(ISERROR(VLOOKUP($A149,Paste!$B$5:$T$500,4,FALSE))=TRUE,0,VLOOKUP($A149,Paste!$B$5:$T$500,4,FALSE))","v":0},{"$f":"IF(ISERROR(VLOOKUP($A149,Paste!$B$5:$T$500,8,FALSE))=TRUE,0,VLOOKUP($A149,Paste!$B$5:$T$500,8,FALSE))","v":0},{"$f":"IF(ISERROR(VLOOKUP($A149,Paste!$B$5:$T$500,11,FALSE))=TRUE,0,VLOOKUP($A149,Paste!$B$5:$T$500,11,FALSE))","v":0},{"$f":"IF(ISERROR(VLOOKUP($A149,Paste!$B$5:$T$500,16,FALSE))=TRUE,0,VLOOKUP($A149,Paste!$B$5:$T$500,16,FALSE))","v":0},{"$f":"IF(ISERROR(VLOOKUP($A149,Paste!$B$5:$T$500,19,FALSE))=TRUE,0,VLOOKUP($A149,Paste!$B$5:$T$500,19,FALSE))","v":0}]
["39919",{"$f":"IF(ISERROR(VLOOKUP($A150,Paste!$B$5:$T$500,4,FALSE))=TRUE,0,VLOOKUP($A150,Paste!$B$5:$T$500,4,FALSE))","v":0},{"$f":"IF(ISERROR(VLOOKUP($A150,Paste!$B$5:$T$500,8,FALSE))=TRUE,0,VLOOKUP($A150,Paste!$B$5:$T$500,8,FALSE))","v":0},{"$f":"IF(ISERROR(VLOOKUP($A150,Paste!$B$5:$T$500,11,FALSE))=TRUE,0,VLOOKUP($A150,Paste!$B$5:$T$500,11,FALSE))","v":0},{"$f":"IF(ISERROR(VLOOKUP($A150,Paste!$B$5:$T$500,16,FALSE))=TRUE,0,VLOOKUP($A150,Paste!$B$5:$T$500,16,FALSE))","v":0},{"$f":"IF(ISERROR(VLOOKUP($A150,Paste!$B$5:$T$500,19,FALSE))=TRUE,0,VLOOKUP($A150,Paste!$B$5:$T$500,19,FALSE))","v":0}]
["39920",{"$f":"IF(ISERROR(VLOOKUP($A151,Paste!$B$5:$T$500,4,FALSE))=TRUE,0,VLOOKUP($A151,Paste!$B$5:$T$500,4,FALSE))","v":0},{"$f":"IF(ISERROR(VLOOKUP($A151,Paste!$B$5:$T$500,8,FALSE))=TRUE,0,VLOOKUP($A151,Paste!$B$5:$T$500,8,FALSE))","v":0},{"$f":"IF(ISERROR(VLOOKUP($A151,Paste!$B$5:$T$500,11,FALSE))=TRUE,0,VLOOKUP($A151,Paste!$B$5:$T$500,11,FALSE))","v":0},{"$f":"IF(ISERROR(VLOOKUP($A151,Paste!$B$5:$T$500,16,FALSE))=TRUE,0,VLOOKUP($A151,Paste!$B$5:$T$500,16,FALSE))","v":0},{"$f":"IF(ISERROR(VLOOKUP($A151,Paste!$B$5:$T$500,19,FALSE))=TRUE,0,VLOOKUP($A151,Paste!$B$5:$T$500,19,FALSE))","v":0}]
["39921",{"$f":"IF(ISERROR(VLOOKUP($A152,Paste!$B$5:$T$500,4,FALSE))=TRUE,0,VLOOKUP($A152,Paste!$B$5:$T$500,4,FALSE))","v":0},{"$f":"IF(ISERROR(VLOOKUP($A152,Paste!$B$5:$T$500,8,FALSE))=TRUE,0,VLOOKUP($A152,Paste!$B$5:$T$500,8,FALSE))","v":0},{"$f":"IF(ISERROR(VLOOKUP($A152,Paste!$B$5:$T$500,11,FALSE))=TRUE,0,VLOOKUP($A152,Paste!$B$5:$T$500,11,FALSE))","v":0},{"$f":"IF(ISERROR(VLOOKUP($A152,Paste!$B$5:$T$500,16,FALSE))=TRUE,0,VLOOKUP($A152,Paste!$B$5:$T$500,16,FALSE))","v":0},{"$f":"IF(ISERROR(VLOOKUP($A152,Paste!$B$5:$T$500,19,FALSE))=TRUE,0,VLOOKUP($A152,Paste!$B$5:$T$500,19,FALSE))","v":0}]
["39922",{"$f":"IF(ISERROR(VLOOKUP($A153,Paste!$B$5:$T$500,4,FALSE))=TRUE,0,VLOOKUP($A153,Paste!$B$5:$T$500,4,FALSE))","v":0},{"$f":"IF(ISERROR(VLOOKUP($A153,Paste!$B$5:$T$500,8,FALSE))=TRUE,0,VLOOKUP($A153,Paste!$B$5:$T$500,8,FALSE))","v":0},{"$f":"IF(ISERROR(VLOOKUP($A153,Paste!$B$5:$T$500,11,FALSE))=TRUE,0,VLOOKUP($A153,Paste!$B$5:$T$500,11,FALSE))","v":0},{"$f":"IF(ISERROR(VLOOKUP($A153,Paste!$B$5:$T$500,16,FALSE))=TRUE,0,VLOOKUP($A153,Paste!$B$5:$T$500,16,FALSE))","v":0},{"$f":"IF(ISERROR(VLOOKUP($A153,Paste!$B$5:$T$500,19,FALSE))=TRUE,0,VLOOKUP($A153,Paste!$B$5:$T$500,19,FALSE))","v":0}]
["39923",{"$f":"IF(ISERROR(VLOOKUP($A154,Paste!$B$5:$T$500,4,FALSE))=TRUE,0,VLOOKUP($A154,Paste!$B$5:$T$500,4,FALSE))","v":0},{"$f":"IF(ISERROR(VLOOKUP($A154,Paste!$B$5:$T$500,8,FALSE))=TRUE,0,VLOOKUP($A154,Paste!$B$5:$T$500,8,FALSE))","v":0},{"$f":"IF(ISERROR(VLOOKUP($A154,Paste!$B$5:$T$500,11,FALSE))=TRUE,0,VLOOKUP($A154,Paste!$B$5:$T$500,11,FALSE))","v":0},{"$f":"IF(ISERROR(VLOOKUP($A154,Paste!$B$5:$T$500,16,FALSE))=TRUE,0,VLOOKUP($A154,Paste!$B$5:$T$500,16,FALSE))","v":0},{"$f":"IF(ISERROR(VLOOKUP($A154,Paste!$B$5:$T$500,19,FALSE))=TRUE,0,VLOOKUP($A154,Paste!$B$5:$T$500,19,FALSE))","v":0}]
["39924",{"$f":"IF(ISERROR(VLOOKUP($A155,Paste!$B$5:$T$500,4,FALSE))=TRUE,0,VLOOKUP($A155,Paste!$B$5:$T$500,4,FALSE))","v":0},{"$f":"IF(ISERROR(VLOOKUP($A155,Paste!$B$5:$T$500,8,FALSE))=TRUE,0,VLOOKUP($A155,Paste!$B$5:$T$500,8,FALSE))","v":0},{"$f":"IF(ISERROR(VLOOKUP($A155,Paste!$B$5:$T$500,11,FALSE))=TRUE,0,VLOOKUP($A155,Paste!$B$5:$T$500,11,FALSE))","v":0},{"$f":"IF(ISERROR(VLOOKUP($A155,Paste!$B$5:$T$500,16,FALSE))=TRUE,0,VLOOKUP($A155,Paste!$B$5:$T$500,16,FALSE))","v":0},{"$f":"IF(ISERROR(VLOOKUP($A155,Paste!$B$5:$T$500,19,FALSE))=TRUE,0,VLOOKUP($A155,Paste!$B$5:$T$500,19,FALSE))","v":0}]
["39925",{"$f":"IF(ISERROR(VLOOKUP($A156,Paste!$B$5:$T$500,4,FALSE))=TRUE,0,VLOOKUP($A156,Paste!$B$5:$T$500,4,FALSE))","v":0},{"$f":"IF(ISERROR(VLOOKUP($A156,Paste!$B$5:$T$500,8,FALSE))=TRUE,0,VLOOKUP($A156,Paste!$B$5:$T$500,8,FALSE))","v":0},{"$f":"IF(ISERROR(VLOOKUP($A156,Paste!$B$5:$T$500,11,FALSE))=TRUE,0,VLOOKUP($A156,Paste!$B$5:$T$500,11,FALSE))","v":0},{"$f":"IF(ISERROR(VLOOKUP($A156,Paste!$B$5:$T$500,16,FALSE))=TRUE,0,VLOOKUP($A156,Paste!$B$5:$T$500,16,FALSE))","v":0},{"$f":"IF(ISERROR(VLOOKUP($A156,Paste!$B$5:$T$500,19,FALSE))=TRUE,0,VLOOKUP($A156,Paste!$B$5:$T$500,19,FALSE))","v":0}]
["39926",{"$f":"IF(ISERROR(VLOOKUP($A157,Paste!$B$5:$T$500,4,FALSE))=TRUE,0,VLOOKUP($A157,Paste!$B$5:$T$500,4,FALSE))","v":0},{"$f":"IF(ISERROR(VLOOKUP($A157,Paste!$B$5:$T$500,8,FALSE))=TRUE,0,VLOOKUP($A157,Paste!$B$5:$T$500,8,FALSE))","v":0},{"$f":"IF(ISERROR(VLOOKUP($A157,Paste!$B$5:$T$500,11,FALSE))=TRUE,0,VLOOKUP($A157,Paste!$B$5:$T$500,11,FALSE))","v":0},{"$f":"IF(ISERROR(VLOOKUP($A157,Paste!$B$5:$T$500,16,FALSE))=TRUE,0,VLOOKUP($A157,Paste!$B$5:$T$500,16,FALSE))","v":0},{"$f":"IF(ISERROR(VLOOKUP($A157,Paste!$B$5:$T$500,19,FALSE))=TRUE,0,VLOOKUP($A157,Paste!$B$5:$T$500,19,FALSE))","v":0}]
["39927",{"$f":"IF(ISERROR(VLOOKUP($A158,Paste!$B$5:$T$500,4,FALSE))=TRUE,0,VLOOKUP($A158,Paste!$B$5:$T$500,4,FALSE))","v":0},{"$f":"IF(ISERROR(VLOOKUP($A158,Paste!$B$5:$T$500,8,FALSE))=TRUE,0,VLOOKUP($A158,Paste!$B$5:$T$500,8,FALSE))","v":0},{"$f":"IF(ISERROR(VLOOKUP($A158,Paste!$B$5:$T$500,11,FALSE))=TRUE,0,VLOOKUP($A158,Paste!$B$5:$T$500,11,FALSE))","v":0},{"$f":"IF(ISERROR(VLOOKUP($A158,Paste!$B$5:$T$500,16,FALSE))=TRUE,0,VLOOKUP($A158,Paste!$B$5:$T$500,16,FALSE))","v":0},{"$f":"IF(ISERROR(VLOOKUP($A158,Paste!$B$5:$T$500,19,FALSE))=TRUE,0,VLOOKUP($A158,Paste!$B$5:$T$500,19,FALSE))","v":0}]
["39928",{"$f":"IF(ISERROR(VLOOKUP($A159,Paste!$B$5:$T$500,4,FALSE))=TRUE,0,VLOOKUP($A159,Paste!$B$5:$T$500,4,FALSE))","v":0},{"$f":"IF(ISERROR(VLOOKUP($A159,Paste!$B$5:$T$500,8,FALSE))=TRUE,0,VLOOKUP($A159,Paste!$B$5:$T$500,8,FALSE))","v":0},{"$f":"IF(ISERROR(VLOOKUP($A159,Paste!$B$5:$T$500,11,FALSE))=TRUE,0,VLOOKUP($A159,Paste!$B$5:$T$500,11,FALSE))","v":0},{"$f":"IF(ISERROR(VLOOKUP($A159,Paste!$B$5:$T$500,16,FALSE))=TRUE,0,VLOOKUP($A159,Paste!$B$5:$T$500,16,FALSE))","v":0},{"$f":"IF(ISERROR(VLOOKUP($A159,Paste!$B$5:$T$500,19,FALSE))=TRUE,0,VLOOKUP($A159,Paste!$B$5:$T$500,19,FALSE))","v":0}]
["39929",{"$f":"IF(ISERROR(VLOOKUP($A160,Paste!$B$5:$T$500,4,FALSE))=TRUE,0,VLOOKUP($A160,Paste!$B$5:$T$500,4,FALSE))","v":0},{"$f":"IF(ISERROR(VLOOKUP($A160,Paste!$B$5:$T$500,8,FALSE))=TRUE,0,VLOOKUP($A160,Paste!$B$5:$T$500,8,FALSE))","v":0},{"$f":"IF(ISERROR(VLOOKUP($A160,Paste!$B$5:$T$500,11,FALSE))=TRUE,0,VLOOKUP($A160,Paste!$B$5:$T$500,11,FALSE))","v":0},{"$f":"IF(ISERROR(VLOOKUP($A160,Paste!$B$5:$T$500,16,FALSE))=TRUE,0,VLOOKUP($A160,Paste!$B$5:$T$500,16,FALSE))","v":0},{"$f":"IF(ISERROR(VLOOKUP($A160,Paste!$B$5:$T$500,19,FALSE))=TRUE,0,VLOOKUP($A160,Paste!$B$5:$T$500,19,FALSE))","v":0}]
["39988",{"$f":"IF(ISERROR(VLOOKUP($A161,Paste!$B$5:$T$500,4,FALSE))=TRUE,0,VLOOKUP($A161,Paste!$B$5:$T$500,4,FALSE))","v":0},{"$f":"IF(ISERROR(VLOOKUP($A161,Paste!$B$5:$T$500,8,FALSE))=TRUE,0,VLOOKUP($A161,Paste!$B$5:$T$500,8,FALSE))","v":0},{"$f":"IF(ISERROR(VLOOKUP($A161,Paste!$B$5:$T$500,11,FALSE))=TRUE,0,VLOOKUP($A161,Paste!$B$5:$T$500,11,FALSE))","v":0},{"$f":"IF(ISERROR(VLOOKUP($A161,Paste!$B$5:$T$500,16,FALSE))=TRUE,0,VLOOKUP($A161,Paste!$B$5:$T$500,16,FALSE))","v":0},{"$f":"IF(ISERROR(VLOOKUP($A161,Paste!$B$5:$T$500,19,FALSE))=TRUE,0,VLOOKUP($A161,Paste!$B$5:$T$500,19,FALSE))","v":0}]
["40101",{"$f":"IF(ISERROR(VLOOKUP($A162,Paste!$B$5:$T$500,4,FALSE))=TRUE,0,VLOOKUP($A162,Paste!$B$5:$T$500,4,FALSE))","v":0},{"$f":"IF(ISERROR(VLOOKUP($A162,Paste!$B$5:$T$500,8,FALSE))=TRUE,0,VLOOKUP($A162,Paste!$B$5:$T$500,8,FALSE))","v":0},{"$f":"IF(ISERROR(VLOOKUP($A162,Paste!$B$5:$T$500,11,FALSE))=TRUE,0,VLOOKUP($A162,Paste!$B$5:$T$500,11,FALSE))","v":0},{"$f":"IF(ISERROR(VLOOKUP($A162,Paste!$B$5:$T$500,16,FALSE))=TRUE,0,VLOOKUP($A162,Paste!$B$5:$T$500,16,FALSE))","v":0},{"$f":"IF(ISERROR(VLOOKUP($A162,Paste!$B$5:$T$500,19,FALSE))=TRUE,0,VLOOKUP($A162,Paste!$B$5:$T$500,19,FALSE))","v":0}]
["40102",{"$f":"IF(ISERROR(VLOOKUP($A163,Paste!$B$5:$T$500,4,FALSE))=TRUE,0,VLOOKUP($A163,Paste!$B$5:$T$500,4,FALSE))","v":0},{"$f":"IF(ISERROR(VLOOKUP($A163,Paste!$B$5:$T$500,8,FALSE))=TRUE,0,VLOOKUP($A163,Paste!$B$5:$T$500,8,FALSE))","v":0},{"$f":"IF(ISERROR(VLOOKUP($A163,Paste!$B$5:$T$500,11,FALSE))=TRUE,0,VLOOKUP($A163,Paste!$B$5:$T$500,11,FALSE))","v":0},{"$f":"IF(ISERROR(VLOOKUP($A163,Paste!$B$5:$T$500,16,FALSE))=TRUE,0,VLOOKUP($A163,Paste!$B$5:$T$500,16,FALSE))","v":0},{"$f":"IF(ISERROR(VLOOKUP($A163,Paste!$B$5:$T$500,19,FALSE))=TRUE,0,VLOOKUP($A163,Paste!$B$5:$T$500,19,FALSE))","v":0}]
["40103",{"$f":"IF(ISERROR(VLOOKUP($A164,Paste!$B$5:$T$500,4,FALSE))=TRUE,0,VLOOKUP($A164,Paste!$B$5:$T$500,4,FALSE))","v":0},{"$f":"IF(ISERROR(VLOOKUP($A164,Paste!$B$5:$T$500,8,FALSE))=TRUE,0,VLOOKUP($A164,Paste!$B$5:$T$500,8,FALSE))","v":0},{"$f":"IF(ISERROR(VLOOKUP($A164,Paste!$B$5:$T$500,11,FALSE))=TRUE,0,VLOOKUP($A164,Paste!$B$5:$T$500,11,FALSE))","v":0},{"$f":"IF(ISERROR(VLOOKUP($A164,Paste!$B$5:$T$500,16,FALSE))=TRUE,0,VLOOKUP($A164,Paste!$B$5:$T$500,16,FALSE))","v":0},{"$f":"IF(ISERROR(VLOOKUP($A164,Paste!$B$5:$T$500,19,FALSE))=TRUE,0,VLOOKUP($A164,Paste!$B$5:$T$500,19,FALSE))","v":0}]
["40104",{"$f":"IF(ISERROR(VLOOKUP($A165,Paste!$B$5:$T$500,4,FALSE))=TRUE,0,VLOOKUP($A165,Paste!$B$5:$T$500,4,FALSE))","v":0},{"$f":"IF(ISERROR(VLOOKUP($A165,Paste!$B$5:$T$500,8,FALSE))=TRUE,0,VLOOKUP($A165,Paste!$B$5:$T$500,8,FALSE))","v":0},{"$f":"IF(ISERROR(VLOOKUP($A165,Paste!$B$5:$T$500,11,FALSE))=TRUE,0,VLOOKUP($A165,Paste!$B$5:$T$500,11,FALSE))","v":0},{"$f":"IF(ISERROR(VLOOKUP($A165,Paste!$B$5:$T$500,16,FALSE))=TRUE,0,VLOOKUP($A165,Paste!$B$5:$T$500,16,FALSE))","v":0},{"$f":"IF(ISERROR(VLOOKUP($A165,Paste!$B$5:$T$500,19,FALSE))=TRUE,0,VLOOKUP($A165,Paste!$B$5:$T$500,19,FALSE))","v":0}]
["40105",{"$f":"IF(ISERROR(VLOOKUP($A166,Paste!$B$5:$T$500,4,FALSE))=TRUE,0,VLOOKUP($A166,Paste!$B$5:$T$500,4,FALSE))","v":0},{"$f":"IF(ISERROR(VLOOKUP($A166,Paste!$B$5:$T$500,8,FALSE))=TRUE,0,VLOOKUP($A166,Paste!$B$5:$T$500,8,FALSE))","v":0},{"$f":"IF(ISERROR(VLOOKUP($A166,Paste!$B$5:$T$500,11,FALSE))=TRUE,0,VLOOKUP($A166,Paste!$B$5:$T$500,11,FALSE))","v":0},{"$f":"IF(ISERROR(VLOOKUP($A166,Paste!$B$5:$T$500,16,FALSE))=TRUE,0,VLOOKUP($A166,Paste!$B$5:$T$500,16,FALSE))","v":0},{"$f":"IF(ISERROR(VLOOKUP($A166,Paste!$B$5:$T$500,19,FALSE))=TRUE,0,VLOOKUP($A166,Paste!$B$5:$T$500,19,FALSE))","v":0}]
["40106",{"$f":"IF(ISERROR(VLOOKUP($A167,Paste!$B$5:$T$500,4,FALSE))=TRUE,0,VLOOKUP($A167,Paste!$B$5:$T$500,4,FALSE))","v":0},{"$f":"IF(ISERROR(VLOOKUP($A167,Paste!$B$5:$T$500,8,FALSE))=TRUE,0,VLOOKUP($A167,Paste!$B$5:$T$500,8,FALSE))","v":0},{"$f":"IF(ISERROR(VLOOKUP($A167,Paste!$B$5:$T$500,11,FALSE))=TRUE,0,VLOOKUP($A167,Paste!$B$5:$T$500,11,FALSE))","v":0},{"$f":"IF(ISERROR(VLOOKUP($A167,Paste!$B$5:$T$500,16,FALSE))=TRUE,0,VLOOKUP($A167,Paste!$B$5:$T$500,16,FALSE))","v":0},{"$f":"IF(ISERROR(VLOOKUP($A167,Paste!$B$5:$T$500,19,FALSE))=TRUE,0,VLOOKUP($A167,Paste!$B$5:$T$500,19,FALSE))","v":0}]
["40107",{"$f":"IF(ISERROR(VLOOKUP($A168,Paste!$B$5:$T$500,4,FALSE))=TRUE,0,VLOOKUP($A168,Paste!$B$5:$T$500,4,FALSE))","v":0},{"$f":"IF(ISERROR(VLOOKUP($A168,Paste!$B$5:$T$500,8,FALSE))=TRUE,0,VLOOKUP($A168,Paste!$B$5:$T$500,8,FALSE))","v":0},{"$f":"IF(ISERROR(VLOOKUP($A168,Paste!$B$5:$T$500,11,FALSE))=TRUE,0,VLOOKUP($A168,Paste!$B$5:$T$500,11,FALSE))","v":0},{"$f":"IF(ISERROR(VLOOKUP($A168,Paste!$B$5:$T$500,16,FALSE))=TRUE,0,VLOOKUP($A168,Paste!$B$5:$T$500,16,FALSE))","v":0},{"$f":"IF(ISERROR(VLOOKUP($A168,Paste!$B$5:$T$500,19,FALSE))=TRUE,0,VLOOKUP($A168,Paste!$B$5:$T$500,19,FALSE))","v":0}]
["40201",{"$f":"IF(ISERROR(VLOOKUP($A169,Paste!$B$5:$T$500,4,FALSE))=TRUE,0,VLOOKUP($A169,Paste!$B$5:$T$500,4,FALSE))","v":0},{"$f":"IF(ISERROR(VLOOKUP($A169,Paste!$B$5:$T$500,8,FALSE))=TRUE,0,VLOOKUP($A169,Paste!$B$5:$T$500,8,FALSE))","v":0},{"$f":"IF(ISERROR(VLOOKUP($A169,Paste!$B$5:$T$500,11,FALSE))=TRUE,0,VLOOKUP($A169,Paste!$B$5:$T$500,11,FALSE))","v":0},{"$f":"IF(ISERROR(VLOOKUP($A169,Paste!$B$5:$T$500,16,FALSE))=TRUE,0,VLOOKUP($A169,Paste!$B$5:$T$500,16,FALSE))","v":0},{"$f":"IF(ISERROR(VLOOKUP($A169,Paste!$B$5:$T$500,19,FALSE))=TRUE,0,VLOOKUP($A169,Paste!$B$5:$T$500,19,FALSE))","v":0}]
["40202",{"$f":"IF(ISERROR(VLOOKUP($A170,Paste!$B$5:$T$500,4,FALSE))=TRUE,0,VLOOKUP($A170,Paste!$B$5:$T$500,4,FALSE))","v":0},{"$f":"IF(ISERROR(VLOOKUP($A170,Paste!$B$5:$T$500,8,FALSE))=TRUE,0,VLOOKUP($A170,Paste!$B$5:$T$500,8,FALSE))","v":0},{"$f":"IF(ISERROR(VLOOKUP($A170,Paste!$B$5:$T$500,11,FALSE))=TRUE,0,VLOOKUP($A170,Paste!$B$5:$T$500,11,FALSE))","v":0},{"$f":"IF(ISERROR(VLOOKUP($A170,Paste!$B$5:$T$500,16,FALSE))=TRUE,0,VLOOKUP($A170,Paste!$B$5:$T$500,16,FALSE))","v":0},{"$f":"IF(ISERROR(VLOOKUP($A170,Paste!$B$5:$T$500,19,FALSE))=TRUE,0,VLOOKUP($A170,Paste!$B$5:$T$500,19,FALSE))","v":0}]
["40203",{"$f":"IF(ISERROR(VLOOKUP($A171,Paste!$B$5:$T$500,4,FALSE))=TRUE,0,VLOOKUP($A171,Paste!$B$5:$T$500,4,FALSE))","v":0},{"$f":"IF(ISERROR(VLOOKUP($A171,Paste!$B$5:$T$500,8,FALSE))=TRUE,0,VLOOKUP($A171,Paste!$B$5:$T$500,8,FALSE))","v":0},{"$f":"IF(ISERROR(VLOOKUP($A171,Paste!$B$5:$T$500,11,FALSE))=TRUE,0,VLOOKUP($A171,Paste!$B$5:$T$500,11,FALSE))","v":0},{"$f":"IF(ISERROR(VLOOKUP($A171,Paste!$B$5:$T$500,16,FALSE))=TRUE,0,VLOOKUP($A171,Paste!$B$5:$T$500,16,FALSE))","v":0},{"$f":"IF(ISERROR(VLOOKUP($A171,Paste!$B$5:$T$500,19,FALSE))=TRUE,0,VLOOKUP($A171,Paste!$B$5:$T$500,19,FALSE))","v":0}]
["40204",{"$f":"IF(ISERROR(VLOOKUP($A172,Paste!$B$5:$T$500,4,FALSE))=TRUE,0,VLOOKUP($A172,Paste!$B$5:$T$500,4,FALSE))","v":0},{"$f":"IF(ISERROR(VLOOKUP($A172,Paste!$B$5:$T$500,8,FALSE))=TRUE,0,VLOOKUP($A172,Paste!$B$5:$T$500,8,FALSE))","v":0},{"$f":"IF(ISERROR(VLOOKUP($A172,Paste!$B$5:$T$500,11,FALSE))=TRUE,0,VLOOKUP($A172,Paste!$B$5:$T$500,11,FALSE))","v":0},{"$f":"IF(ISERROR(VLOOKUP($A172,Paste!$B$5:$T$500,16,FALSE))=TRUE,0,VLOOKUP($A172,Paste!$B$5:$T$500,16,FALSE))","v":0},{"$f":"IF(ISERROR(VLOOKUP($A172,Paste!$B$5:$T$500,19,FALSE))=TRUE,0,VLOOKUP($A172,Paste!$B$5:$T$500,19,FALSE))","v":0}]
["40205",{"$f":"IF(ISERROR(VLOOKUP($A173,Paste!$B$5:$T$500,4,FALSE))=TRUE,0,VLOOKUP($A173,Paste!$B$5:$T$500,4,FALSE))","v":0},{"$f":"IF(ISERROR(VLOOKUP($A173,Paste!$B$5:$T$500,8,FALSE))=TRUE,0,VLOOKUP($A173,Paste!$B$5:$T$500,8,FALSE))","v":0},{"$f":"IF(ISERROR(VLOOKUP($A173,Paste!$B$5:$T$500,11,FALSE))=TRUE,0,VLOOKUP($A173,Paste!$B$5:$T$500,11,FALSE))","v":0},{"$f":"IF(ISERROR(VLOOKUP($A173,Paste!$B$5:$T$500,16,FALSE))=TRUE,0,VLOOKUP($A173,Paste!$B$5:$T$500,16,FALSE))","v":0},{"$f":"IF(ISERROR(VLOOKUP($A173,Paste!$B$5:$T$500,19,FALSE))=TRUE,0,VLOOKUP($A173,Paste!$B$5:$T$500,19,FALSE))","v":0}]
["40206",{"$f":"IF(ISERROR(VLOOKUP($A174,Paste!$B$5:$T$500,4,FALSE))=TRUE,0,VLOOKUP($A174,Paste!$B$5:$T$500,4,FALSE))","v":0},{"$f":"IF(ISERROR(VLOOKUP($A174,Paste!$B$5:$T$500,8,FALSE))=TRUE,0,VLOOKUP($A174,Paste!$B$5:$T$500,8,FALSE))","v":0},{"$f":"IF(ISERROR(VLOOKUP($A174,Paste!$B$5:$T$500,11,FALSE))=TRUE,0,VLOOKUP($A174,Paste!$B$5:$T$500,11,FALSE))","v":0},{"$f":"IF(ISERROR(VLOOKUP($A174,Paste!$B$5:$T$500,16,FALSE))=TRUE,0,VLOOKUP($A174,Paste!$B$5:$T$500,16,FALSE))","v":0},{"$f":"IF(ISERROR(VLOOKUP($A174,Paste!$B$5:$T$500,19,FALSE))=TRUE,0,VLOOKUP($A174,Paste!$B$5:$T$500,19,FALSE))","v":0}]
["40207",{"$f":"IF(ISERROR(VLOOKUP($A175,Paste!$B$5:$T$500,4,FALSE))=TRUE,0,VLOOKUP($A175,Paste!$B$5:$T$500,4,FALSE))","v":0},{"$f":"IF(ISERROR(VLOOKUP($A175,Paste!$B$5:$T$500,8,FALSE))=TRUE,0,VLOOKUP($A175,Paste!$B$5:$T$500,8,FALSE))","v":0},{"$f":"IF(ISERROR(VLOOKUP($A175,Paste!$B$5:$T$500,11,FALSE))=TRUE,0,VLOOKUP($A175,Paste!$B$5:$T$500,11,FALSE))","v":0},{"$f":"IF(ISERROR(VLOOKUP($A175,Paste!$B$5:$T$500,16,FALSE))=TRUE,0,VLOOKUP($A175,Paste!$B$5:$T$500,16,FALSE))","v":0},{"$f":"IF(ISERROR(VLOOKUP($A175,Paste!$B$5:$T$500,19,FALSE))=TRUE,0,VLOOKUP($A175,Paste!$B$5:$T$500,19,FALSE))","v":0}]
["40208",{"$f":"IF(ISERROR(VLOOKUP($A176,Paste!$B$5:$T$500,4,FALSE))=TRUE,0,VLOOKUP($A176,Paste!$B$5:$T$500,4,FALSE))","v":0},{"$f":"IF(ISERROR(VLOOKUP($A176,Paste!$B$5:$T$500,8,FALSE))=TRUE,0,VLOOKUP($A176,Paste!$B$5:$T$500,8,FALSE))","v":0},{"$f":"IF(ISERROR(VLOOKUP($A176,Paste!$B$5:$T$500,11,FALSE))=TRUE,0,VLOOKUP($A176,Paste!$B$5:$T$500,11,FALSE))","v":0},{"$f":"IF(ISERROR(VLOOKUP($A176,Paste!$B$5:$T$500,16,FALSE))=TRUE,0,VLOOKUP($A176,Paste!$B$5:$T$500,16,FALSE))","v":0},{"$f":"IF(ISERROR(VLOOKUP($A176,Paste!$B$5:$T$500,19,FALSE))=TRUE,0,VLOOKUP($A176,Paste!$B$5:$T$500,19,FALSE))","v":0}]
["40209",{"$f":"IF(ISERROR(VLOOKUP($A177,Paste!$B$5:$T$500,4,FALSE))=TRUE,0,VLOOKUP($A177,Paste!$B$5:$T$500,4,FALSE))","v":0},{"$f":"IF(ISERROR(VLOOKUP($A177,Paste!$B$5:$T$500,8,FALSE))=TRUE,0,VLOOKUP($A177,Paste!$B$5:$T$500,8,FALSE))","v":0},{"$f":"IF(ISERROR(VLOOKUP($A177,Paste!$B$5:$T$500,11,FALSE))=TRUE,0,VLOOKUP($A177,Paste!$B$5:$T$500,11,FALSE))","v":0},{"$f":"IF(ISERROR(VLOOKUP($A177,Paste!$B$5:$T$500,16,FALSE))=TRUE,0,VLOOKUP($A177,Paste!$B$5:$T$500,16,FALSE))","v":0},{"$f":"IF(ISERROR(VLOOKUP($A177,Paste!$B$5:$T$500,19,FALSE))=TRUE,0,VLOOKUP($A177,Paste!$B$5:$T$500,19,FALSE))","v":0}]
["40301",{"$f":"IF(ISERROR(VLOOKUP($A178,Paste!$B$5:$T$500,4,FALSE))=TRUE,0,VLOOKUP($A178,Paste!$B$5:$T$500,4,FALSE))","v":0},{"$f":"IF(ISERROR(VLOOKUP($A178,Paste!$B$5:$T$500,8,FALSE))=TRUE,0,VLOOKUP($A178,Paste!$B$5:$T$500,8,FALSE))","v":0},{"$f":"IF(ISERROR(VLOOKUP($A178,Paste!$B$5:$T$500,11,FALSE))=TRUE,0,VLOOKUP($A178,Paste!$B$5:$T$500,11,FALSE))","v":0},{"$f":"IF(ISERROR(VLOOKUP($A178,Paste!$B$5:$T$500,16,FALSE))=TRUE,0,VLOOKUP($A178,Paste!$B$5:$T$500,16,FALSE))","v":0},{"$f":"IF(ISERROR(VLOOKUP($A178,Paste!$B$5:$T$500,19,FALSE))=TRUE,0,VLOOKUP($A178,Paste!$B$5:$T$500,19,FALSE))","v":0}]
["40302",{"$f":"IF(ISERROR(VLOOKUP($A179,Paste!$B$5:$T$500,4,FALSE))=TRUE,0,VLOOKUP($A179,Paste!$B$5:$T$500,4,FALSE))","v":0},{"$f":"IF(ISERROR(VLOOKUP($A179,Paste!$B$5:$T$500,8,FALSE))=TRUE,0,VLOOKUP($A179,Paste!$B$5:$T$500,8,FALSE))","v":0},{"$f":"IF(ISERROR(VLOOKUP($A179,Paste!$B$5:$T$500,11,FALSE))=TRUE,0,VLOOKUP($A179,Paste!$B$5:$T$500,11,FALSE))","v":0},{"$f":"IF(ISERROR(VLOOKUP($A179,Paste!$B$5:$T$500,16,FALSE))=TRUE,0,VLOOKUP($A179,Paste!$B$5:$T$500,16,FALSE))","v":0},{"$f":"IF(ISERROR(VLOOKUP($A179,Paste!$B$5:$T$500,19,FALSE))=TRUE,0,VLOOKUP($A179,Paste!$B$5:$T$500,19,FALSE))","v":0}]
["40303",{"$f":"IF(ISERROR(VLOOKUP($A180,Paste!$B$5:$T$500,4,FALSE))=TRUE,0,VLOOKUP($A180,Paste!$B$5:$T$500,4,FALSE))","v":0},{"$f":"IF(ISERROR(VLOOKUP($A180,Paste!$B$5:$T$500,8,FALSE))=TRUE,0,VLOOKUP($A180,Paste!$B$5:$T$500,8,FALSE))","v":0},{"$f":"IF(ISERROR(VLOOKUP($A180,Paste!$B$5:$T$500,11,FALSE))=TRUE,0,VLOOKUP($A180,Paste!$B$5:$T$500,11,FALSE))","v":0},{"$f":"IF(ISERROR(VLOOKUP($A180,Paste!$B$5:$T$500,16,FALSE))=TRUE,0,VLOOKUP($A180,Paste!$B$5:$T$500,16,FALSE))","v":0},{"$f":"IF(ISERROR(VLOOKUP($A180,Paste!$B$5:$T$500,19,FALSE))=TRUE,0,VLOOKUP($A180,Paste!$B$5:$T$500,19,FALSE))","v":0}]
["40304",{"$f":"IF(ISERROR(VLOOKUP($A181,Paste!$B$5:$T$500,4,FALSE))=TRUE,0,VLOOKUP($A181,Paste!$B$5:$T$500,4,FALSE))","v":0},{"$f":"IF(ISERROR(VLOOKUP($A181,Paste!$B$5:$T$500,8,FALSE))=TRUE,0,VLOOKUP($A181,Paste!$B$5:$T$500,8,FALSE))","v":0},{"$f":"IF(ISERROR(VLOOKUP($A181,Paste!$B$5:$T$500,11,FALSE))=TRUE,0,VLOOKUP($A181,Paste!$B$5:$T$500,11,FALSE))","v":0},{"$f":"IF(ISERROR(VLOOKUP($A181,Paste!$B$5:$T$500,16,FALSE))=TRUE,0,VLOOKUP($A181,Paste!$B$5:$T$500,16,FALSE))","v":0},{"$f":"IF(ISERROR(VLOOKUP($A181,Paste!$B$5:$T$500,19,FALSE))=TRUE,0,VLOOKUP($A181,Paste!$B$5:$T$500,19,FALSE))","v":0}]
["40305",{"$f":"IF(ISERROR(VLOOKUP($A182,Paste!$B$5:$T$500,4,FALSE))=TRUE,0,VLOOKUP($A182,Paste!$B$5:$T$500,4,FALSE))","v":0},{"$f":"IF(ISERROR(VLOOKUP($A182,Paste!$B$5:$T$500,8,FALSE))=TRUE,0,VLOOKUP($A182,Paste!$B$5:$T$500,8,FALSE))","v":0},{"$f":"IF(ISERROR(VLOOKUP($A182,Paste!$B$5:$T$500,11,FALSE))=TRUE,0,VLOOKUP($A182,Paste!$B$5:$T$500,11,FALSE))","v":0},{"$f":"IF(ISERROR(VLOOKUP($A182,Paste!$B$5:$T$500,16,FALSE))=TRUE,0,VLOOKUP($A182,Paste!$B$5:$T$500,16,FALSE))","v":0},{"$f":"IF(ISERROR(VLOOKUP($A182,Paste!$B$5:$T$500,19,FALSE))=TRUE,0,VLOOKUP($A182,Paste!$B$5:$T$500,19,FALSE))","v":0}]
["40306",{"$f":"IF(ISERROR(VLOOKUP($A183,Paste!$B$5:$T$500,4,FALSE))=TRUE,0,VLOOKUP($A183,Paste!$B$5:$T$500,4,FALSE))","v":0},{"$f":"IF(ISERROR(VLOOKUP($A183,Paste!$B$5:$T$500,8,FALSE))=TRUE,0,VLOOKUP($A183,Paste!$B$5:$T$500,8,FALSE))","v":0},{"$f":"IF(ISERROR(VLOOKUP($A183,Paste!$B$5:$T$500,11,FALSE))=TRUE,0,VLOOKUP($A183,Paste!$B$5:$T$500,11,FALSE))","v":0},{"$f":"IF(ISERROR(VLOOKUP($A183,Paste!$B$5:$T$500,16,FALSE))=TRUE,0,VLOOKUP($A183,Paste!$B$5:$T$500,16,FALSE))","v":0},{"$f":"IF(ISERROR(VLOOKUP($A183,Paste!$B$5:$T$500,19,FALSE))=TRUE,0,VLOOKUP($A183,Paste!$B$5:$T$500,19,FALSE))","v":0}]
["40307",{"$f":"IF(ISERROR(VLOOKUP($A184,Paste!$B$5:$T$500,4,FALSE))=TRUE,0,VLOOKUP($A184,Paste!$B$5:$T$500,4,FALSE))","v":0},{"$f":"IF(ISERROR(VLOOKUP($A184,Paste!$B$5:$T$500,8,FALSE))=TRUE,0,VLOOKUP($A184,Paste!$B$5:$T$500,8,FALSE))","v":0},{"$f":"IF(ISERROR(VLOOKUP($A184,Paste!$B$5:$T$500,11,FALSE))=TRUE,0,VLOOKUP($A184,Paste!$B$5:$T$500,11,FALSE))","v":0},{"$f":"IF(ISERROR(VLOOKUP($A184,Paste!$B$5:$T$500,16,FALSE))=TRUE,0,VLOOKUP($A184,Paste!$B$5:$T$500,16,FALSE))","v":0},{"$f":"IF(ISERROR(VLOOKUP($A184,Paste!$B$5:$T$500,19,FALSE))=TRUE,0,VLOOKUP($A184,Paste!$B$5:$T$500,19,FALSE))","v":0}]
["40308",{"$f":"IF(ISERROR(VLOOKUP($A185,Paste!$B$5:$T$500,4,FALSE))=TRUE,0,VLOOKUP($A185,Paste!$B$5:$T$500,4,FALSE))","v":0},{"$f":"IF(ISERROR(VLOOKUP($A185,Paste!$B$5:$T$500,8,FALSE))=TRUE,0,VLOOKUP($A185,Paste!$B$5:$T$500,8,FALSE))","v":0},{"$f":"IF(ISERROR(VLOOKUP($A185,Paste!$B$5:$T$500,11,FALSE))=TRUE,0,VLOOKUP($A185,Paste!$B$5:$T$500,11,FALSE))","v":0},{"$f":"IF(ISERROR(VLOOKUP($A185,Paste!$B$5:$T$500,16,FALSE))=TRUE,0,VLOOKUP($A185,Paste!$B$5:$T$500,16,FALSE))","v":0},{"$f":"IF(ISERROR(VLOOKUP($A185,Paste!$B$5:$T$500,19,FALSE))=TRUE,0,VLOOKUP($A185,Paste!$B$5:$T$500,19,FALSE))","v":0}]
["40309",{"$f":"IF(ISERROR(VLOOKUP($A186,Paste!$B$5:$T$500,4,FALSE))=TRUE,0,VLOOKUP($A186,Paste!$B$5:$T$500,4,FALSE))","v":0},{"$f":"IF(ISERROR(VLOOKUP($A186,Paste!$B$5:$T$500,8,FALSE))=TRUE,0,VLOOKUP($A186,Paste!$B$5:$T$500,8,FALSE))","v":0},{"$f":"IF(ISERROR(VLOOKUP($A186,Paste!$B$5:$T$500,11,FALSE))=TRUE,0,VLOOKUP($A186,Paste!$B$5:$T$500,11,FALSE))","v":0},{"$f":"IF(ISERROR(VLOOKUP($A186,Paste!$B$5:$T$500,16,FALSE))=TRUE,0,VLOOKUP($A186,Paste!$B$5:$T$500,16,FALSE))","v":0},{"$f":"IF(ISERROR(VLOOKUP($A186,Paste!$B$5:$T$500,19,FALSE))=TRUE,0,VLOOKUP($A186,Paste!$B$5:$T$500,19,FALSE))","v":0}]
["40310",{"$f":"IF(ISERROR(VLOOKUP($A187,Paste!$B$5:$T$500,4,FALSE))=TRUE,0,VLOOKUP($A187,Paste!$B$5:$T$500,4,FALSE))","v":0},{"$f":"IF(ISERROR(VLOOKUP($A187,Paste!$B$5:$T$500,8,FALSE))=TRUE,0,VLOOKUP($A187,Paste!$B$5:$T$500,8,FALSE))","v":0},{"$f":"IF(ISERROR(VLOOKUP($A187,Paste!$B$5:$T$500,11,FALSE))=TRUE,0,VLOOKUP($A187,Paste!$B$5:$T$500,11,FALSE))","v":0},{"$f":"IF(ISERROR(VLOOKUP($A187,Paste!$B$5:$T$500,16,FALSE))=TRUE,0,VLOOKUP($A187,Paste!$B$5:$T$500,16,FALSE))","v":0},{"$f":"IF(ISERROR(VLOOKUP($A187,Paste!$B$5:$T$500,19,FALSE))=TRUE,0,VLOOKUP($A187,Paste!$B$5:$T$500,19,FALSE))","v":0}]
["40311",{"$f":"IF(ISERROR(VLOOKUP($A188,Paste!$B$5:$T$500,4,FALSE))=TRUE,0,VLOOKUP($A188,Paste!$B$5:$T$500,4,FALSE))","v":0},{"$f":"IF(ISERROR(VLOOKUP($A188,Paste!$B$5:$T$500,8,FALSE))=TRUE,0,VLOOKUP($A188,Paste!$B$5:$T$500,8,FALSE))","v":0},{"$f":"IF(ISERROR(VLOOKUP($A188,Paste!$B$5:$T$500,11,FALSE))=TRUE,0,VLOOKUP($A188,Paste!$B$5:$T$500,11,FALSE))","v":0},{"$f":"IF(ISERROR(VLOOKUP($A188,Paste!$B$5:$T$500,16,FALSE))=TRUE,0,VLOOKUP($A188,Paste!$B$5:$T$500,16,FALSE))","v":0},{"$f":"IF(ISERROR(VLOOKUP($A188,Paste!$B$5:$T$500,19,FALSE))=TRUE,0,VLOOKUP($A188,Paste!$B$5:$T$500,19,FALSE))","v":0}]
["40312",{"$f":"IF(ISERROR(VLOOKUP($A189,Paste!$B$5:$T$500,4,FALSE))=TRUE,0,VLOOKUP($A189,Paste!$B$5:$T$500,4,FALSE))","v":0},{"$f":"IF(ISERROR(VLOOKUP($A189,Paste!$B$5:$T$500,8,FALSE))=TRUE,0,VLOOKUP($A189,Paste!$B$5:$T$500,8,FALSE))","v":0},{"$f":"IF(ISERROR(VLOOKUP($A189,Paste!$B$5:$T$500,11,FALSE))=TRUE,0,VLOOKUP($A189,Paste!$B$5:$T$500,11,FALSE))","v":0},{"$f":"IF(ISERROR(VLOOKUP($A189,Paste!$B$5:$T$500,16,FALSE))=TRUE,0,VLOOKUP($A189,Paste!$B$5:$T$500,16,FALSE))","v":0},{"$f":"IF(ISERROR(VLOOKUP($A189,Paste!$B$5:$T$500,19,FALSE))=TRUE,0,VLOOKUP($A189,Paste!$B$5:$T$500,19,FALSE))","v":0}]
["40313",{"$f":"IF(ISERROR(VLOOKUP($A190,Paste!$B$5:$T$500,4,FALSE))=TRUE,0,VLOOKUP($A190,Paste!$B$5:$T$500,4,FALSE))","v":0},{"$f":"IF(ISERROR(VLOOKUP($A190,Paste!$B$5:$T$500,8,FALSE))=TRUE,0,VLOOKUP($A190,Paste!$B$5:$T$500,8,FALSE))","v":0},{"$f":"IF(ISERROR(VLOOKUP($A190,Paste!$B$5:$T$500,11,FALSE))=TRUE,0,VLOOKUP($A190,Paste!$B$5:$T$500,11,FALSE))","v":0},{"$f":"IF(ISERROR(VLOOKUP($A190,Paste!$B$5:$T$500,16,FALSE))=TRUE,0,VLOOKUP($A190,Paste!$B$5:$T$500,16,FALSE))","v":0},{"$f":"IF(ISERROR(VLOOKUP($A190,Paste!$B$5:$T$500,19,FALSE))=TRUE,0,VLOOKUP($A190,Paste!$B$5:$T$500,19,FALSE))","v":0}]
["40314",{"$f":"IF(ISERROR(VLOOKUP($A191,Paste!$B$5:$T$500,4,FALSE))=TRUE,0,VLOOKUP($A191,Paste!$B$5:$T$500,4,FALSE))","v":0},{"$f":"IF(ISERROR(VLOOKUP($A191,Paste!$B$5:$T$500,8,FALSE))=TRUE,0,VLOOKUP($A191,Paste!$B$5:$T$500,8,FALSE))","v":0},{"$f":"IF(ISERROR(VLOOKUP($A191,Paste!$B$5:$T$500,11,FALSE))=TRUE,0,VLOOKUP($A191,Paste!$B$5:$T$500,11,FALSE))","v":0},{"$f":"IF(ISERROR(VLOOKUP($A191,Paste!$B$5:$T$500,16,FALSE))=TRUE,0,VLOOKUP($A191,Paste!$B$5:$T$500,16,FALSE))","v":0},{"$f":"IF(ISERROR(VLOOKUP($A191,Paste!$B$5:$T$500,19,FALSE))=TRUE,0,VLOOKUP($A191,Paste!$B$5:$T$500,19,FALSE))","v":0}]
["40315",{"$f":"IF(ISERROR(VLOOKUP($A192,Paste!$B$5:$T$500,4,FALSE))=TRUE,0,VLOOKUP($A192,Paste!$B$5:$T$500,4,FALSE))","v":0},{"$f":"IF(ISERROR(VLOOKUP($A192,Paste!$B$5:$T$500,8,FALSE))=TRUE,0,VLOOKUP($A192,Paste!$B$5:$T$500,8,FALSE))","v":0},{"$f":"IF(ISERROR(VLOOKUP($A192,Paste!$B$5:$T$500,11,FALSE))=TRUE,0,VLOOKUP($A192,Paste!$B$5:$T$500,11,FALSE))","v":0},{"$f":"IF(ISERROR(VLOOKUP($A192,Paste!$B$5:$T$500,16,FALSE))=TRUE,0,VLOOKUP($A192,Paste!$B$5:$T$500,16,FALSE))","v":0},{"$f":"IF(ISERROR(VLOOKUP($A192,Paste!$B$5:$T$500,19,FALSE))=TRUE,0,VLOOKUP($A192,Paste!$B$5:$T$500,19,FALSE))","v":0}]
["40316",{"$f":"IF(ISERROR(VLOOKUP($A193,Paste!$B$5:$T$500,4,FALSE))=TRUE,0,VLOOKUP($A193,Paste!$B$5:$T$500,4,FALSE))","v":0},{"$f":"IF(ISERROR(VLOOKUP($A193,Paste!$B$5:$T$500,8,FALSE))=TRUE,0,VLOOKUP($A193,Paste!$B$5:$T$500,8,FALSE))","v":0},{"$f":"IF(ISERROR(VLOOKUP($A193,Paste!$B$5:$T$500,11,FALSE))=TRUE,0,VLOOKUP($A193,Paste!$B$5:$T$500,11,FALSE))","v":0},{"$f":"IF(ISERROR(VLOOKUP($A193,Paste!$B$5:$T$500,16,FALSE))=TRUE,0,VLOOKUP($A193,Paste!$B$5:$T$500,16,FALSE))","v":0},{"$f":"IF(ISERROR(VLOOKUP($A193,Paste!$B$5:$T$500,19,FALSE))=TRUE,0,VLOOKUP($A193,Paste!$B$5:$T$500,19,FALSE))","v":0}]
["40317",{"$f":"IF(ISERROR(VLOOKUP($A194,Paste!$B$5:$T$500,4,FALSE))=TRUE,0,VLOOKUP($A194,Paste!$B$5:$T$500,4,FALSE))","v":0},{"$f":"IF(ISERROR(VLOOKUP($A194,Paste!$B$5:$T$500,8,FALSE))=TRUE,0,VLOOKUP($A194,Paste!$B$5:$T$500,8,FALSE))","v":0},{"$f":"IF(ISERROR(VLOOKUP($A194,Paste!$B$5:$T$500,11,FALSE))=TRUE,0,VLOOKUP($A194,Paste!$B$5:$T$500,11,FALSE))","v":0},{"$f":"IF(ISERROR(VLOOKUP($A194,Paste!$B$5:$T$500,16,FALSE))=TRUE,0,VLOOKUP($A194,Paste!$B$5:$T$500,16,FALSE))","v":0},{"$f":"IF(ISERROR(VLOOKUP($A194,Paste!$B$5:$T$500,19,FALSE))=TRUE,0,VLOOKUP($A194,Paste!$B$5:$T$500,19,FALSE))","v":0}]
["40318",{"$f":"IF(ISERROR(VLOOKUP($A195,Paste!$B$5:$T$500,4,FALSE))=TRUE,0,VLOOKUP($A195,Paste!$B$5:$T$500,4,FALSE))","v":0},{"$f":"IF(ISERROR(VLOOKUP($A195,Paste!$B$5:$T$500,8,FALSE))=TRUE,0,VLOOKUP($A195,Paste!$B$5:$T$500,8,FALSE))","v":0},{"$f":"IF(ISERROR(VLOOKUP($A195,Paste!$B$5:$T$500,11,FALSE))=TRUE,0,VLOOKUP($A195,Paste!$B$5:$T$500,11,FALSE))","v":0},{"$f":"IF(ISERROR(VLOOKUP($A195,Paste!$B$5:$T$500,16,FALSE))=TRUE,0,VLOOKUP($A195,Paste!$B$5:$T$500,16,FALSE))","v":0},{"$f":"IF(ISERROR(VLOOKUP($A195,Paste!$B$5:$T$500,19,FALSE))=TRUE,0,VLOOKUP($A195,Paste!$B$5:$T$500,19,FALSE))","v":0}]
["40319",{"$f":"IF(ISERROR(VLOOKUP($A196,Paste!$B$5:$T$500,4,FALSE))=TRUE,0,VLOOKUP($A196,Paste!$B$5:$T$500,4,FALSE))","v":0},{"$f":"IF(ISERROR(VLOOKUP($A196,Paste!$B$5:$T$500,8,FALSE))=TRUE,0,VLOOKUP($A196,Paste!$B$5:$T$500,8,FALSE))","v":0},{"$f":"IF(ISERROR(VLOOKUP($A196,Paste!$B$5:$T$500,11,FALSE))=TRUE,0,VLOOKUP($A196,Paste!$B$5:$T$500,11,FALSE))","v":0},{"$f":"IF(ISERROR(VLOOKUP($A196,Paste!$B$5:$T$500,16,FALSE))=TRUE,0,VLOOKUP($A196,Paste!$B$5:$T$500,16,FALSE))","v":0},{"$f":"IF(ISERROR(VLOOKUP($A196,Paste!$B$5:$T$500,19,FALSE))=TRUE,0,VLOOKUP($A196,Paste!$B$5:$T$500,19,FALSE))","v":0}]
["40320",{"$f":"IF(ISERROR(VLOOKUP($A197,Paste!$B$5:$T$500,4,FALSE))=TRUE,0,VLOOKUP($A197,Paste!$B$5:$T$500,4,FALSE))","v":0},{"$f":"IF(ISERROR(VLOOKUP($A197,Paste!$B$5:$T$500,8,FALSE))=TRUE,0,VLOOKUP($A197,Paste!$B$5:$T$500,8,FALSE))","v":0},{"$f":"IF(ISERROR(VLOOKUP($A197,Paste!$B$5:$T$500,11,FALSE))=TRUE,0,VLOOKUP($A197,Paste!$B$5:$T$500,11,FALSE))","v":0},{"$f":"IF(ISERROR(VLOOKUP($A197,Paste!$B$5:$T$500,16,FALSE))=TRUE,0,VLOOKUP($A197,Paste!$B$5:$T$500,16,FALSE))","v":0},{"$f":"IF(ISERROR(VLOOKUP($A197,Paste!$B$5:$T$500,19,FALSE))=TRUE,0,VLOOKUP($A197,Paste!$B$5:$T$500,19,FALSE))","v":0}]
["40321",{"$f":"IF(ISERROR(VLOOKUP($A198,Paste!$B$5:$T$500,4,FALSE))=TRUE,0,VLOOKUP($A198,Paste!$B$5:$T$500,4,FALSE))","v":0},{"$f":"IF(ISERROR(VLOOKUP($A198,Paste!$B$5:$T$500,8,FALSE))=TRUE,0,VLOOKUP($A198,Paste!$B$5:$T$500,8,FALSE))","v":0},{"$f":"IF(ISERROR(VLOOKUP($A198,Paste!$B$5:$T$500,11,FALSE))=TRUE,0,VLOOKUP($A198,Paste!$B$5:$T$500,11,FALSE))","v":0},{"$f":"IF(ISERROR(VLOOKUP($A198,Paste!$B$5:$T$500,16,FALSE))=TRUE,0,VLOOKUP($A198,Paste!$B$5:$T$500,16,FALSE))","v":0},{"$f":"IF(ISERROR(VLOOKUP($A198,Paste!$B$5:$T$500,19,FALSE))=TRUE,0,VLOOKUP($A198,Paste!$B$5:$T$500,19,FALSE))","v":0}]
["40322",{"$f":"IF(ISERROR(VLOOKUP($A199,Paste!$B$5:$T$500,4,FALSE))=TRUE,0,VLOOKUP($A199,Paste!$B$5:$T$500,4,FALSE))","v":0},{"$f":"IF(ISERROR(VLOOKUP($A199,Paste!$B$5:$T$500,8,FALSE))=TRUE,0,VLOOKUP($A199,Paste!$B$5:$T$500,8,FALSE))","v":0},{"$f":"IF(ISERROR(VLOOKUP($A199,Paste!$B$5:$T$500,11,FALSE))=TRUE,0,VLOOKUP($A199,Paste!$B$5:$T$500,11,FALSE))","v":0},{"$f":"IF(ISERROR(VLOOKUP($A199,Paste!$B$5:$T$500,16,FALSE))=TRUE,0,VLOOKUP($A199,Paste!$B$5:$T$500,16,FALSE))","v":0},{"$f":"IF(ISERROR(VLOOKUP($A199,Paste!$B$5:$T$500,19,FALSE))=TRUE,0,VLOOKUP($A199,Paste!$B$5:$T$500,19,FALSE))","v":0}]
["40323",{"$f":"IF(ISERROR(VLOOKUP($A200,Paste!$B$5:$T$500,4,FALSE))=TRUE,0,VLOOKUP($A200,Paste!$B$5:$T$500,4,FALSE))","v":0},{"$f":"IF(ISERROR(VLOOKUP($A200,Paste!$B$5:$T$500,8,FALSE))=TRUE,0,VLOOKUP($A200,Paste!$B$5:$T$500,8,FALSE))","v":0},{"$f":"IF(ISERROR(VLOOKUP($A200,Paste!$B$5:$T$500,11,FALSE))=TRUE,0,VLOOKUP($A200,Paste!$B$5:$T$500,11,FALSE))","v":0},{"$f":"IF(ISERROR(VLOOKUP($A200,Paste!$B$5:$T$500,16,FALSE))=TRUE,0,VLOOKUP($A200,Paste!$B$5:$T$500,16,FALSE))","v":0},{"$f":"IF(ISERROR(VLOOKUP($A200,Paste!$B$5:$T$500,19,FALSE))=TRUE,0,VLOOKUP($A200,Paste!$B$5:$T$500,19,FALSE))","v":0}]
["40324",{"$f":"IF(ISERROR(VLOOKUP($A201,Paste!$B$5:$T$500,4,FALSE))=TRUE,0,VLOOKUP($A201,Paste!$B$5:$T$500,4,FALSE))","v":0},{"$f":"IF(ISERROR(VLOOKUP($A201,Paste!$B$5:$T$500,8,FALSE))=TRUE,0,VLOOKUP($A201,Paste!$B$5:$T$500,8,FALSE))","v":0},{"$f":"IF(ISERROR(VLOOKUP($A201,Paste!$B$5:$T$500,11,FALSE))=TRUE,0,VLOOKUP($A201,Paste!$B$5:$T$500,11,FALSE))","v":0},{"$f":"IF(ISERROR(VLOOKUP($A201,Paste!$B$5:$T$500,16,FALSE))=TRUE,0,VLOOKUP($A201,Paste!$B$5:$T$500,16,FALSE))","v":0},{"$f":"IF(ISERROR(VLOOKUP($A201,Paste!$B$5:$T$500,19,FALSE))=TRUE,0,VLOOKUP($A201,Paste!$B$5:$T$500,19,FALSE))","v":0}]

{"sheet":"Summary","index":18,"n_rows":88,"n_cols":9,"rows_kept":88,"cut":false,"hidden":false,"merged":[[0,0,0,8]]}
[]
[]
[null,null,2013,2024,"2012",{"$f":"$D$3","v":2024},null,null,{"$f":"$D$3","v":2024}]
[null,null,"Productive","Productive","Assessed","Assessed","Productive Value","Assessed Value","Level of"]
["LINE","CLASSIFICATION","Value","Value","Value","Value","Change","% Change","Assessment"]
["A","AGRICULTRAL LAND",{"$f":"C25","v":88541541},{"$f":"D25","v":0},{"$f":"E25","v":8411446},{"$f":"F25","v":0},{"$f":"D6-C6","v":-88541541},{"$f":"IF(E6=0,\"\",F6/E6-1)","v":-1},{"$f":"IF(D6=0,\"N/A\",F6/D6)","v":"N/A"}]
["B","REAL PROPERTY",{"$f":"C42","v":2895652332},{"$f":"D42","v":0},{"$f":"E42","v":275086972},{"$f":"F42","v":0},-2895652332,-1,"N/A"]
["C","PERSONAL PROPERTY",{"$f":"C49","v":123742509},{"$f":"D49","v":0},{"$f":"E49","v":11755538},{"$f":"F49","v":0},-123742509,-1,"N/A"]
["D","INDUSTRIAL PROPERTY",{"$f":"C88","v":73328255},{"$f":"D88","v":0},{"$f":"E88","v":7860117.9799999995},{"$f":"F88","v":0},-73328255,-1,"N/A"]
[null,"STATE ASSESSED - MINERALS",7232933,null,null,null,-7232933,"","N/A"]
[null,"STATE ASSESSED - OTHER",477351784,null,null,null,-477351784,"","N/A"]
[null,null,null,null,null,null,null,""]
[null,"LOCALLY ASSESSED VALUATION",{"$f":"SUM(C6:C9)","v":3181264637},{"$f":"SUM(D6:D9)","v":0},{"$f":"SUM(E6:E9)","v":303114073.98000002},{"$f":"SUM(F6:F9)","v":0},{"$f":"SUM(G6:G9)","v":-3181264637},-1]
[null,"STATE ASSESSED VALUATION",{"$f":"SUM(C10:C11)","v":484584717},{"$f":"SUM(D10:D11)","v":0},{"$f":"SUM(E10:E11)","v":0},{"$f":"SUM(F10:F11)","v":0},{"$f":"SUM(G10:G11)","v":-484584717},""]
[null,"TOTAL VALUATION",{"$f":"SUM(C13:C14)","v":3665849354},{"$f":"SUM(D13:D14)","v":0},{"$f":"SUM(E13:E14)","v":303114073.98000002},{"$f":"SUM(F13:F14)","v":0},{"$f":"SUM(G13:G14)","v":-3665849354},-1]
[]
[]
[]
[null,null,"2012",{"$f":"$D$3","v":2024},"2012",{"$f":"$D$3","v":2024},null,null,{"$f":"$D$3","v":2024}]
[null,null,"Productive","Productive","Assessed","Assessed","Productive Value","Assessed Value","Level of"]
["AGRICULTURAL LANDS",null,"Value","Value","Value","Value","Change","% Change","Assessment"]
[110,"IRRIGATED",21444569,{"$f":"'Page 2'!E13","v":0},2037234,{"$f":"'Page 2'!F13","v":0},{"$f":"D22-C22","v":-21444569},{"$f":"IF(E22=0,\"\",F22/E22-1)","v":-1},{"$f":"IF(D22=0,\"N/A\",F22/D22)","v":"N/A"}]
[120,"DRY CROP",0,{"$f":"'Page 2'!E30","v":0},0,{"$f":"'Page 2'!F30","v":0},{"$f":"D23-C23","v":0},{"$f":"IF(E23=0,\"\",F23/E23-1)","v":""},{"$f":"IF(D23=0,\"N/A\",F23/D23)","v":"N/A"}]
[130,"RANGE",67096972,{"$f":"'Page 3'!F38","v":0},6374212,{"$f":"'Page 3'!G38","v":0},{"$f":"D24-C24","v":-67096972},{"$f":"IF(E24=0,\"\",F24/E24-1)","v":-1},{"$f":"IF(D24=0,\"N/A\",F24/D24)","v":"N/A"}]
["A","TOTAL AG LANDS",{"$f":"SUM(C22:C24)","v":88541541},{"$f":"SUM(D22:D24)","v":0},{"$f":"SUM(E22:E24)","v":8411446},{"$f":"SUM(F22:F24)","v":0},{"$f":"SUM(G22:G24)","v":-88541541},{"$f":"IF(E25=0,\"\",F25/E25-1)","v":-1},{"$f":"IF(D25=0,\"N/A\",F25/D25)","v":"N/A"}]
[]
[null,null,"2012",{"$f":"$D$3","v":2024},"2012",{"$f":"$D$3","v":2024}]
["AG ACREAGE",null,"Acres","Acres","Value/Acre","Value/Acre","Acre Change","Value/Acre Change"]
[110,"IRRIGATED",68513,{"$f":"'Page 2'!C13","v":0},313,{"$f":"IF(D29<>0,D22/D29,0)","v":0},{"$f":"D29-C29","v":-68513},{"$f":"F29-E29","v":-313}]
[120,"DRY CROP",0,{"$f":"'Page 2'!C30","v":0},0,{"$f":"IF(D30<>0,D23/D30,0)","v":0},{"$f":"D30-C30","v":0},{"$f":"F30-E30","v":0}]
[130,"RANGE",1596267,{"$f":"'Page 3'!D38","v":0},42.033677323405172,{"$f":"IF(D31<>0,D24/D31,0)","v":0},{"$f":"D31-C31","v":-1596267},{"$f":"F31-E31","v":-42.033677323405172}]
[]
[]
[]
[null,null,"2012",{"$f":"$D$3","v":2024},"2012",{"$f":"$D$3","v":2024},"Dollar","%",{"$f":"$D$3","v":2024}]
[null,null,"Fair Market","Fair Market","Assessed","Assessed","Market Value","Assessed Value","Level of"]
["REAL PROPERTY",null,"Value","Value","Value","Value","Change","Change","Assessment"]
[200,"RESIDENTIAL LAND",588484073,{"$f":"'Page 4'!D13","v":0},55905987,{"$f":"'Page 4'!E13","v":0},{"$f":"D38-C38","v":-588484073},{"$f":"IF(E38=0,\"\",F38/E38-1)","v":-1},{"$f":"IF(D38=0,\"N/A\",F38/D38)","v":"N/A"}]
[300,"RESIDENTIAL IMPROVED",1644341667,{"$f":"'Page 4'!D22","v":0},156212458,{"$f":"'Page 4'!E22","v":0},{"$f":"D39-C39","v":-1644341667},{"$f":"IF(E39=0,\"\",F39/E39-1)","v":-1},{"$f":"IF(D39=0,\"N/A\",F39/D39)","v":"N/A"}]
[400,"COMMERCIAL LAND",124031723,{"$f":"'Page 4'!D26","v":0},11783014,{"$f":"'Page 4'!E26","v":0},{"$f":"D40-C40","v":-124031723},{"$f":"IF(E40=0,\"\",F40/E40-1)","v":-1},{"$f":"IF(D40=0,\"N/A\",F40/D40)","v":"N/A"}]
[500,"COMMERCIAL IMPROVED",538794869,{"$f":"'Page 4'!D44","v":0},51185513,{"$f":"'Page 4'!E44","v":0},{"$f":"D41-C41","v":-538794869},{"$f":"IF(E41=0,\"\",F41/E41-1)","v":-1},{"$f":"IF(D41=0,\"N/A\",F41/D41)","v":"N/A"}]
["B","TOTAL REAL PROPERTY",{"$f":"SUM(C38:C41)","v":2895652332},{"$f":"SUM(D38:D41)","v":0},{"$f":"SUM(E38:E41)","v":275086972},{"$f":"SUM(F38:F41)","v":0},{"$f":"SUM(G38:G41)","v":-2895652332},{"$f":"IF(E42=0,\"\",F42/E42-1)","v":-1},{"$f":"IF(D42=0,\"N/A\",F42/D42)","v":"N/A"}]
[]
[null,null,"2012",{"$f":"$D$3","v":2024},"2012",{"$f":"$D$3","v":2024},"Dollar","%",{"$f":"$D$3","v":2024}]
[null,null,"Fair Market","Fair Market","Assessed","Assessed","Market Value","Assessed Value","Level of"]
["COMMERCIAL PROPERTY",null,"Value","Value","Value","Value","Change","Change","Assessment"]
[610,"RESIDENTIAL PERSONAL PROPERTY",20191750,{"$f":"'Page 4'!D52","v":0},1918216,{"$f":"'Page 4'!E52","v":0},{"$f":"D47-C47","v":-20191750},{"$f":"IF(E47=0,\"\",F47/E47-1)","v":-1},{"$f":"IF(D47=0,\"N/A\",F47/D47)","v":"N/A"}]
[730,"COMMERCAIL PERSONAL PROPERTY",103550759,{"$f":"'Page 4'!D57","v":0},9837322,{"$f":"'Page 4'!E57","v":0},{"$f":"D48-C48","v":-103550759},{"$f":"IF(E48=0,\"\",F48/E48-1)","v":-1},{"$f":"IF(D48=0,\"N/A\",F48/D48)","v":"N/A"}]
["C","TOTAL PERSONAL PROPERTY",{"$f":"SUM(C47:C48)","v":123742509},{"$f":"SUM(D47:D48)","v":0},{"$f":"SUM(E47:E48)","v":11755538},{"$f":"SUM(F47:F48)","v":0},{"$f":"SUM(G47:G48)","v":-123742509},{"$f":"IF(E49=0,\"\",F49/E49-1)","v":-1},{"$f":"IF(D49=0,\"N/A\",F49/D49)","v":"N/A"}]
[]
[]
[]
[null,null,"2012",{"$f":"$D$3","v":2024},"2012",{"$f":"$D$3","v":2024},"Dollar","%",{"$f":"$D$3","v":2024}]
[null,null,"Fair Market","Fair Market","Assessed","Assessed","Market Value","Assessed Value","Level of"]
["INDUSTRIAL PROPERTY",null,"Value","Value","Value","Value","Change","Change","Assessment"]
[801,"Food Manufacturing",23712,{"$f":"'Page 5'!H7","v":0},2726.88,{"$f":"'Page 5'!I7","v":0},{"$f":"D56-C56","v":-23712},{"$f":"IF(E56=0,\"\",F56/E56-1)","v":-1},{"$f":"IF(D56=0,\"N/A\",F56/D56)","v":"N/A"}]
[802,"Beverage Manufacturing",0,{"$f":"'Page 5'!H12","v":0},0,{"$f":"'Page 5'!I12","v":0},0,"",{"$f":"IF(D57=0,\"N/A\",F57/D57)","v":"N/A"}]
[803,"Tobacco Manufacturing",0,{"$f":"'Page 5'!H17","v":0},0,{"$f":"'Page 5'!I17","v":0},0,"",{"$f":"IF(D58=0,\"N/A\",F58/D58)","v":"N/A"}]
[804,"Manufacture of Textile Mill Products",0,{"$f":"'Page 5'!H22","v":0},0,{"$f":"'Page 5'!I22","v":0},0,"","N/A"]
[805,"Apparel Manufacturing",0,{"$f":"'Page 5'!H27","v":0},0,{"$f":"'Page 5'!I27","v":0},0,"","N/A"]
[806,"Leather Manufacturing",0,{"$f":"'Page 5'!H32","v":0},0,{"$f":"'Page 5'!I32","v":0},0,"","N/A"]
[807,"Wood Product Manufacturing",4232920,{"$f":"'Page 6'!H7","v":0},486785.8,{"$f":"'Page 6'!I7","v":0},-4232920,-1,"N/A"]
[808,"Paper Manufacturing",0,{"$f":"'Page 6'!H12","v":0},0,{"$f":"'Page 6'!I12","v":0},0,"","N/A"]
[809,"Printing - Newspapers, Books etc.",1123973,{"$f":"'Page 6'!H17","v":0},129256.895,{"$f":"'Page 6'!I17","v":0},-1123973,-1,"N/A"]
[810,"Chemical Manufacturing",143865,{"$f":"'Page 6'!H22","v":0},16544.475000000002,{"$f":"'Page 6'!I22","v":0},-143865,-1,"N/A"]
[811,"Plastic & Rubber Product Manufacturing",4490766,{"$f":"'Page 6'!H27","v":0},516438.09,{"$f":"'Page 6'!I27","v":0},-4490766,-1,"N/A"]
[812,"Non-Metallic Mineral Product Manufacturing",52321093,{"$f":"'Page 6'!H32","v":0},6016925.6950000003,{"$f":"'Page 6'!I32","v":0},-52321093,-1,"N/A"]
[813,"Primary Metal Manufacturing",40000,{"$f":"'Page 7'!H7","v":0},4600,{"$f":"'Page 7'!I7","v":0},-40000,-1,"N/A"]
[814,"Fabricated Metal Product Manufacturing",595064,{"$f":"'Page 7'!H12","v":0},68432.36,{"$f":"'Page 7'!I12","v":0},-595064,-1,"N/A"]
[815,"Machinery Manufacturing",16863,{"$f":"'Page 7'!H17","v":0},1939.2449999999999,{"$f":"'Page 7'!I17","v":0},-16863,-1,"N/A"]
[816,"Computer & Electronic Product Manufacturing",130463,{"$f":"'Page 7'!H22","v":0},15003.245000000001,{"$f":"'Page 7'!I22","v":0},-130463,-1,"N/A"]
[817,"Electronic Equip, Appliance & Component Manu.",0,{"$f":"'Page 7'!H27","v":0},0,{"$f":"'Page 7'!I27","v":0},0,"","N/A"]
[818,"Transportation Equipment Manufacturing",0,{"$f":"'Page 7'!H32","v":0},0,{"$f":"'Page 7'!I32","v":0},0,"","N/A"]
[819,"Furniture & Related Product Manufacturing",789645,{"$f":"'Page 8'!H7","v":0},90809.175000000003,{"$f":"'Page 8'!I7","v":0},-789645,-1,"N/A"]
[820,"Medical Equipment & Supplies Manufacturing",0,{"$f":"'Page 8'!H12","v":0},0,{"$f":"'Page 8'!I12","v":0},0,"","N/A"]
[821,"Manufacture of Jewelry, Silverware, Etc.",0,{"$f":"'Page 8'!H17","v":0},0,{"$f":"'Page 8'!I17","v":0},0,"","N/A"]
[822,"Oil & Gas Extraction",2101170,{"$f":"'Page 8'!H22","v":0},241634.55,{"$f":"'Page 8'!I22","v":0},-2101170,-1,"N/A"]
[823,"Coal Mining",0,{"$f":"'Page 8'!H27","v":0},0,{"$f":"'Page 8'!I27","v":0},0,"","N/A"]
[824,"Metal Ore Mining",0,{"$f":"'Page 8'!H32","v":0},0,{"$f":"'Page 8'!I32","v":0},0,"","N/A"]
[825,"Non-Metal Mining & Quarrying",164548,{"$f":"'Page 9'!H7","v":0},18923.02,{"$f":"'Page 9'!I7","v":0},-164548,-1,"N/A"]
[826,"Petroleum & Coal Product Manufacturing",0,{"$f":"'Page 9'!H12","v":0},0,{"$f":"'Page 9'!I12","v":0},0,"","N/A"]
[827,"Basic Chemical Manufacturing",0,{"$f":"'Page 9'!H17","v":0},0,{"$f":"'Page 9'!I17","v":0},0,"","N/A"]
[828,"Pipeline Transportation",0,{"$f":"'Page 9'!H22","v":0},0,{"$f":"'Page 9'!I22","v":0},0,"","N/A"]
[829,"Electric Power Generation",null,{"$f":"'Page 9'!H27","v":0}]
[830,"Unspecified Other",4979403,null,null,null,-4979403,"","N/A"]
[831,"Vacant Industrial Land",1114500,{"$f":"'Page 9'!H29","v":0},128167.5,{"$f":"'Page 9'!I29","v":0},-1114500,-1,"N/A"]
[832,"Pollution Control & Fire Exemptions Granted",1060270,{"$f":"'Page 10'!D35+'Page 11'!D35","v":0},121931.05,{"$f":"'Page 10'!E35+'Page 11'!E35","v":0},-1060270,-1,{"$f":"IF(D87=0,\"N/A\",F87/D87)","v":"N/A"}]
["D","TOTAL INDUSTRIAL",{"$f":"SUM(C56:C87)","v":73328255},0,7860117.9799999995,0,-73328255,-15,{"$f":"IF(D88=0,\"N/A\",F88/D88)","v":"N/A"}]