{"text_format":"1","workbook":"xlsx","n_sheets":19,"sheets":["Page 1","Page 2","Page 3","Page 4","Page 5","Page 6","Page 7","Page 8","Page 9","Page 10","Page 11","Page 12","Page 13","Page 14","Page 15","Test","Paste","Reference","Summary"],"not_rendered":{"charts":0,"images":0,"macros":1,"external_links":0,"defined_names":15,"comments":0,"pivot_tables":0},"unopened":[],"bounds":{"document_bytes":16777216,"sheet_cells":100000,"rows_first":2000,"rows_last":500,"rows_between":2000,"halvings":0,"cell_chars":16384,"cell_head_chars":4096},"cells_cut":0,"cells_raw":0,"read":"whole","date_system":"1900"}

{"sheet":"Page 1","index":0,"n_rows":35,"n_cols":5,"rows_kept":35,"cut":false,"hidden":false,"merged":[[7,9,7,13],[1,1,1,6],[2,1,2,6]]}
[]
[null,"Abstract Assessment Roll"]
[null,"_______________________ County, Wyoming Tax Year 2024"]
[]
[]
[null,"Line","Classification","Market or Productive Value","Assessed Value"]
{"$rows_left_out":30}
{"sheet":"Page 2","index":1,"n_rows":30,"n_cols":6,"rows_kept":30,"cut":false,"hidden":false,"merged":[[10,0,11,0],[10,1,11,1],[10,2,11,2],[10,5,11,5],[10,4,11,4],[10,3,11,3]]}
["Agricultural- Irrigated Crop Lands"]
["Line","Classification","Acres","Productivity Value Per Acre","Productive Value","Assessed Value"]
[null,"LRA 1-2-3        (DOR code)"]
[1,"Class II               40101",{"$f":"IF(ISERROR(VLOOKUP(RIGHT(B4,5),Reference!$A$2:$F$201,5,FALSE))=TRUE,0,VLOOKUP(RIGHT(B4,5),Reference!$A$2:$F$201,5,FALSE))","v":0},{"$f":"IF(C4>0,E4/C4,0)","v":0},{"$f":"VALUE(VLOOKUP(RIGHT(B4,5),Reference!$A$2:$H$201,4,FALSE))","v":0},{"$f":"VALUE(VLOOKUP(RIGHT(B4,5),Reference!$A$2:$H$201,3,FALSE))","v":0}]
[2,"Class III              40102",{"$f":"IF(ISERROR(VLOOKUP(RIGHT(B5,5),Reference!$A$2:$F$201,5,FALSE))=TRUE,0,VLOOKUP(RIGHT(B5,5),Reference!$A$2:$F$201,5,FALSE))","v":0},{"$f":"IF(C5>0,E5/C5,0)","v":0},{"$f":"VALUE(VLOOKUP(RIGHT(B5,5),Reference!$A$2:$H$201,4,FALSE))","v":0},{"$f":"VALUE(VLOOKUP(RIGHT(B5,5),Reference!$A$2:$H$201,3,FALSE))","v":0}]
[3,"Class IV             40103",{"$f":"IF(ISERROR(VLOOKUP(RIGHT(B6,5),Reference!$A$2:$F$201,5,FALSE))=TRUE,0,VLOOKUP(RIGHT(B6,5),Reference!$A$2:$F$201,5,FALSE))","v":0},{"$f":"IF(C6>0,E6/C6,0)","v":0},{"$f":"VALUE(VLOOKUP(RIGHT(B6,5),Reference!$A$2:$H$201,4,FALSE))","v":0},{"$f":"VALUE(VLOOKUP(RIGHT(B6,5),Reference!$A$2:$H$201,3,FALSE))","v":0}]
{"$rows_left_out":25}
{"sheet":"Page 3","index":2,"n_rows":40,"n_cols":7,"rows_kept":40,"cut":false,"hidden":false,"merged":[]}
["Agricultural- Range Lands"]
["Land",null,"Classification","Acres","Productivity Value Per Acre","Productive Value","Assessed Value"]
[null,null,"LRA 1            (DOR Code)"]
[201,null,"R-1                    40301",{"$f":"IF(ISERROR(VLOOKUP(RIGHT(C4,5),Reference!$A$2:$F$201,5,FALSE))=TRUE,0,VLOOKUP(RIGHT(C4,5),Reference!$A$2:$F$201,5,FALSE))","v":0},{"$f":"IF(D4>0,F4/D4,0)","v":0},{"$f":"VALUE(VLOOKUP(RIGHT(C4,5),Reference!$A$2:$H$201,4,FALSE))","v":0},{"$f":"VALUE(VLOOKUP(RIGHT(C4,5),Reference!$A$2:$H$201,3,FALSE))","v":0}]
[202,null,"R-2                    40302",{"$f":"IF(ISERROR(VLOOKUP(RIGHT(C5,5),Reference!$A$2:$F$201,5,FALSE))=TRUE,0,VLOOKUP(RIGHT(C5,5),Reference!$A$2:$F$201,5,FALSE))","v":0},0,{"$f":"VALUE(VLOOKUP(RIGHT(C5,5),Reference!$A$2:$H$201,4,FALSE))","v":0},{"$f":"VALUE(VLOOKUP(RIGHT(C5,5),Reference!$A$2:$H$201,3,FALSE))","v":0}]
[203,null,"R-3                    40303",{"$f":"IF(ISERROR(VLOOKUP(RIGHT(C6,5),Reference!$A$2:$F$201,5,FALSE))=TRUE,0,VLOOKUP(RIGHT(C6,5),Reference!$A$2:$F$201,5,FALSE))","v":0},0,{"$f":"VALUE(VLOOKUP(RIGHT(C6,5),Reference!$A$2:$H$201,4,FALSE))","v":0},{"$f":"VALUE(VLOOKUP(RIGHT(C6,5),Reference!$A$2:$H$201,3,FALSE))","v":0}]
{"$rows_left_out":35}
{"sheet":"Page 4","index":3,"n_rows":58,"n_cols":6,"rows_kept":58,"cut":false,"hidden":false,"merged":[[52,3,52,5],[57,0,57,1],[2,3,2,5],[13,3,13,5],[44,0,44,1],[48,3,48,5],[22,3,22,5],[26,3,26,5]]}
[null,"Residential and Commercial Real Property"]
["Line","Abstract Codes","Classification","Fair Market Value","Assessed Value","Sub Total per Line"]
[301,null,"Residential Lands (Includes Farmsteads)  DOR code- 00101, 00102, 00103,\n 00400, 10001, 10002, 10003, 10004, 10005"]
[null,"00101","   Vacant Land- Residential Vacant- In City Limits",{"$f":"IF(ISERROR(VLOOKUP(B4,Reference!$A$2:$F$201,4,FALSE))=TRUE,0,VLOOKUP(RIGHT(B4,5),Reference!$A$2:$F$201,4,FALSE))","v":0},{"$f":"IF(D4<>0,VLOOKUP(RIGHT(B4,5),Reference!$A$2:$H$201,3,FALSE),0)","v":0}]
[null,"00102","   Vacant Land- Residential Vacant- Out of City Limits- Platted",{"$f":"IF(ISERROR(VLOOKUP(B5,Reference!$A$2:$F$201,4,FALSE))=TRUE,0,VLOOKUP(RIGHT(B5,5),Reference!$A$2:$F$201,4,FALSE))","v":0},{"$f":"IF(D5<>0,VLOOKUP(RIGHT(B5,5),Reference!$A$2:$H$201,3,FALSE),0)","v":0}]
[null,"00103","   Vacant Land- Residential Vacant- Out of City Limits- UnPlatted",{"$f":"IF(ISERROR(VLOOKUP(B6,Reference!$A$2:$F$201,4,FALSE))=TRUE,0,VLOOKUP(RIGHT(B6,5),Reference!$A$2:$F$201,4,FALSE))","v":0},{"$f":"IF(D6<>0,VLOOKUP(RIGHT(B6,5),Reference!$A$2:$H$201,3,FALSE),0)","v":0}]
{"$rows_left_out":53}
{"sheet":"Page 5","index":4,"n_rows":32,"n_cols":9,"rows_kept":32,"cut":false,"hidden":false,"merged":[[7,0,11,0],[7,2,11,2],[2,2,5,2],[2,0,5,0],[22,0,26,0],[22,2,26,2],[27,0,31,0],[27,2,31,2],[12,2,16,2],[12,0,16,0],[17,0,21,0],[17,2,21,2]]}
["Industrial Property"]
["Line","Abstract Code","NAICS","Primary Activity","LAND (FMV)","Improvements (FMV)","Personal Property (FMV)","Total Fair Market Value","TOTAL ASSESSED VALUE"]
[501,"30001","3111 \nthru\n3119","Industrial- Improved Land- Food",{"$f":"IF(ISERROR(VLOOKUP(B3,Reference!$A$2:$F$201,4,FALSE))=TRUE,0,VLOOKUP(RIGHT(B3,5),Reference!$A$2:$F$201,4,FALSE))","v":0},0,0,{"$f":"E3+F3+G3","v":0},{"$f":"IF(H3<>0,VLOOKUP(RIGHT(B3,5),Reference!$A$2:$H$196,3,FALSE),0)","v":0}]
[null,"30101",null,"Industrial- Manufacturing- Food",0,{"$f":"IF(ISERROR(VLOOKUP(B4,Reference!$A$2:$F$201,4,FALSE))=TRUE,0,VLOOKUP(RIGHT(B4,5),Reference!$A$2:$F$201,4,FALSE))","v":0},0,{"$f":"E4+F4+G4","v":0},{"$f":"VLOOKUP(RIGHT(B4,5),Reference!$A$2:$H$196,3,FALSE)","v":0}]
[null,"30401",null,"Industrial- Support/ Out Buildings Only- Food",0,{"$f":"IF(ISERROR(VLOOKUP(B5,Reference!$A$2:$F$201,4,FALSE))=TRUE,0,VLOOKUP(RIGHT(B5,5),Reference!$A$2:$F$201,4,FALSE))","v":0},0,0,{"$f":"VLOOKUP(RIGHT(B5,5),Reference!$A$2:$H$196,3,FALSE)","v":0}]
[null,"39901",null,"Industrial- Personal Property- Food",0,0,{"$f":"IF(ISERROR(VLOOKUP(B6,Reference!$A$2:$F$201,4,FALSE))=TRUE,0,VLOOKUP(RIGHT(B6,5),Reference!$A$2:$F$201,4,FALSE))","v":0},{"$f":"E6+F6+G6","v":0},{"$f":"VLOOKUP(RIGHT(B6,5),Reference!$A$2:$H$196,3,FALSE)","v":0}]
{"$rows_left_out":27}
{"sheet":"Page 6","index":5,"n_rows":32,"n_cols":9,"rows_kept":32,"cut":false,"hidden":false,"merged":[[17,0,21,0],[17,2,21,2],[22,0,26,0],[22,2,26,2],[27,0,31,0],[27,2,31,2],[7,0,11,0],[7,2,11,2],[2,0,5,0],[2,2,5,2],[12,0,16,0],[12,2,16,2]]}
["Industrial Property"]
["Line","DOR","NAICS","Primary Activity","LAND (FMV)","Improvements (FMV)","Personal Property (FMV)","Total Fair Market Value","TOTAL ASSESSED VALUE"]
[507,"30007","3211 \nthru\n3219","Industrial- Improved Land- Wood Product",{"$f":"IF(ISERROR(VLOOKUP(B3,Reference!$A$2:$F$201,4,FALSE))=TRUE,0,VLOOKUP(RIGHT(B3,5),Reference!$A$2:$F$201,4,FALSE))","v":0},0,0,{"$f":"E3+F3+G3","v":0},{"$f":"IF(H3<>0,VLOOKUP(RIGHT(B3,5),Reference!$A$2:$H$196,3,FALSE),0)","v":0}]
[null,"30107",null,"Industrial- Manufacturing- Wood Product",0,{"$f":"IF(ISERROR(VLOOKUP(B4,Reference!$A$2:$F$201,4,FALSE))=TRUE,0,VLOOKUP(RIGHT(B4,5),Reference!$A$2:$F$201,4,FALSE))","v":0},0,{"$f":"E4+F4+G4","v":0},{"$f":"IF(H4<>0,VLOOKUP(RIGHT(B4,5),Reference!$A$2:$H$196,3,FALSE),0)","v":0}]
[null,"30407",null,"Industrial- Support/Out Building Only- Wood Product",0,{"$f":"IF(ISERROR(VLOOKUP(B5,Reference!$A$2:$F$201,4,FALSE))=TRUE,0,VLOOKUP(RIGHT(B5,5),Reference!$A$2:$F$201,4,FALSE))","v":0},0,0,{"$f":"IF(H5<>0,VLOOKUP(RIGHT(B5,5),Reference!$A$2:$H$196,3,FALSE),0)","v":0}]
[null,"39907",null,"Industrial- Personal Property- Wood Product",0,0,{"$f":"IF(ISERROR(VLOOKUP(B6,Reference!$A$2:$F$201,4,FALSE))=TRUE,0,VLOOKUP(RIGHT(B6,5),Reference!$A$2:$F$201,4,FALSE))","v":0},{"$f":"E6+F6+G6","v":0},{"$f":"IF(H6<>0,VLOOKUP(RIGHT(B6,5),Reference!$A$2:$H$196,3,FALSE),0)","v":0}]
{"$rows_left_out":27}
{"sheet":"Page 7","index":6,"n_rows":32,"n_cols":9,"rows_kept":32,"cut":false,"hidden":false,"merged":[[17,0,21,0],[17,2,21,2],[22,0,26,0],[22,2,26,2],[27,0,31,0],[27,2,31,2],[7,0,11,0],[7,2,11,2],[2,0,5,0],[2,2,5,2],[12,0,16,0],[12,2,16,2]]}
["Industrial Property"]
["Line","DOR","NAICS","Primary Activity","LAND (FMV)","Improvements (FMV)","Personal Property (FMV)","Total Fair Market Value","TOTAL ASSESSED VALUE"]
[513,"30013","3311 \nthru\n3315","Industrial- Improved Land- Primary Metal Manufacturing",{"$f":"IF(ISERROR(VLOOKUP(B3,Reference!$A$2:$F$201,4,FALSE))=TRUE,0,VLOOKUP(RIGHT(B3,5),Reference!$A$2:$F$201,4,FALSE))","v":0},0,0,{"$f":"E3+F3+G3","v":0},{"$f":"IF(H3<>0,VLOOKUP(RIGHT(B3,5),Reference!$A$2:$H$196,3,FALSE),0)","v":0}]
[null,"30113",null,"Industrial- Manufacturing- Primary Metal Manufacturing",0,{"$f":"IF(ISERROR(VLOOKUP(B4,Reference!$A$2:$F$201,4,FALSE))=TRUE,0,VLOOKUP(RIGHT(B4,5),Reference!$A$2:$F$201,4,FALSE))","v":0},0,{"$f":"E4+F4+G4","v":0},{"$f":"IF(H4<>0,VLOOKUP(RIGHT(B4,5),Reference!$A$2:$H$196,3,FALSE),0)","v":0}]
[null,"30413",null,"Industrial- Support/Out Building Only- Primary Metal Manufacturing",0,{"$f":"IF(ISERROR(VLOOKUP(B5,Reference!$A$2:$F$201,4,FALSE))=TRUE,0,VLOOKUP(RIGHT(B5,5),Reference!$A$2:$F$201,4,FALSE))","v":0},0,0,{"$f":"IF(H5<>0,VLOOKUP(RIGHT(B5,5),Reference!$A$2:$H$196,3,FALSE),0)","v":0}]
[null,"39913",null,"Industrial- Personal Property- Primary Metal Manufacturing",0,0,{"$f":"IF(ISERROR(VLOOKUP(B6,Reference!$A$2:$F$201,4,FALSE))=TRUE,0,VLOOKUP(RIGHT(B6,5),Reference!$A$2:$F$201,4,FALSE))","v":0},{"$f":"E6+F6+G6","v":0},{"$f":"IF(H6<>0,VLOOKUP(RIGHT(B6,5),Reference!$A$2:$H$196,3,FALSE),0)","v":0}]
{"$rows_left_out":27}
{"sheet":"Page 8","index":7,"n_rows":32,"n_cols":9,"rows_kept":32,"cut":false,"hidden":false,"merged":[[17,0,21,0],[17,2,21,2],[22,0,26,0],[22,2,26,2],[27,0,31,0],[27,2,31,2],[7,0,11,0],[7,2,11,2],[2,0,5,0],[2,2,5,2],[12,0,16,0],[12,2,16,2]]}
["Industrial Property"]
["Line","DOR","NAICS","Primary Activity","LAND (FMV)","Improvements (FMV)","Personal Property (FMV)","Total Fair Market Value","TOTAL ASSESSED VALUE"]
[519,"30019","3371 \nthru\n3379","Industrial- Improved Land- Furniture",{"$f":"IF(ISERROR(VLOOKUP(B3,Reference!$A$2:$F$201,4,FALSE))=TRUE,0,VLOOKUP(RIGHT(B3,5),Reference!$A$2:$F$201,4,FALSE))","v":0},0,0,{"$f":"E3+F3+G3","v":0},{"$f":"IF(H3<>0,VLOOKUP(RIGHT(B3,5),Reference!$A$2:$H$196,3,FALSE),0)","v":0}]
[null,"30119",null,"Industrial- Manufacturing- Furniture",0,{"$f":"IF(ISERROR(VLOOKUP(B4,Reference!$A$2:$F$201,4,FALSE))=TRUE,0,VLOOKUP(RIGHT(B4,5),Reference!$A$2:$F$201,4,FALSE))","v":0},0,{"$f":"E4+F4+G4","v":0},{"$f":"IF(H4<>0,VLOOKUP(RIGHT(B4,5),Reference!$A$2:$H$196,3,FALSE),0)","v":0}]
[null,"30419",null,"Industrial- Support/Out Building Only- Furniture",0,{"$f":"IF(ISERROR(VLOOKUP(B5,Reference!$A$2:$F$201,4,FALSE))=TRUE,0,VLOOKUP(RIGHT(B5,5),Reference!$A$2:$F$201,4,FALSE))","v":0},0,0,{"$f":"IF(H5<>0,VLOOKUP(RIGHT(B5,5),Reference!$A$2:$H$196,3,FALSE),0)","v":0}]
[null,"39919",null,"Industrial- Personal Property- Furniture",0,0,{"$f":"IF(ISERROR(VLOOKUP(B6,Reference!$A$2:$F$201,4,FALSE))=TRUE,0,VLOOKUP(RIGHT(B6,5),Reference!$A$2:$F$201,4,FALSE))","v":0},{"$f":"E6+F6+G6","v":0},{"$f":"IF(H6<>0,VLOOKUP(RIGHT(B6,5),Reference!$A$2:$H$196,3,FALSE),0)","v":0}]
{"$rows_left_out":27}
{"sheet":"Page 9","index":8,"n_rows":30,"n_cols":9,"rows_kept":30,"cut":false,"hidden":false,"merged":[[2,0,6,0],[2,2,6,2],[7,0,11,0],[7,2,11,2],[29,0,29,3],[12,0,16,0],[12,2,16,2],[17,0,21,0],[17,2,21,2],[27,0,28,0],[27,2,28,2],[22,0,26,0],[22,2,26,2]]}
["Industrial Property"]
["Line","DOR","NAICS","Primary Activity","LAND (FMV)","Improvements (FMV)","Personal Property (FMV)","Total Fair Market Value","TOTAL ASSESSED VALUE"]
[525,"30025",2123,"Industrial- Improved Land- Non-Metal Mining",{"$f":"IF(ISERROR(VLOOKUP(B3,Reference!$A$2:$F$201,4,FALSE))=TRUE,0,VLOOKUP(RIGHT(B3,5),Reference!$A$2:$F$201,4,FALSE))","v":0},0,0,{"$f":"E3+F3+G3","v":0},{"$f":"IF(H3<>0,VLOOKUP(RIGHT(B3,5),Reference!$A$2:$H$196,3,FALSE),0)","v":0}]
[null,"30225",null,"Industrial- Mineral Co. Improvements- Non-Metal Mining",0,{"$f":"IF(ISERROR(VLOOKUP(B4,Reference!$A$2:$F$201,4,FALSE))=TRUE,0,VLOOKUP(RIGHT(B4,5),Reference!$A$2:$F$201,4,FALSE))","v":0},0,{"$f":"E4+F4+G4","v":0},{"$f":"IF(H4<>0,VLOOKUP(RIGHT(B4,5),Reference!$A$2:$H$196,3,FALSE),0)","v":0}]
[null,"30425",null,"Industrial- Support/Out Building Only- Non-Metal Mining",0,{"$f":"IF(ISERROR(VLOOKUP(B5,Reference!$A$2:$F$201,4,FALSE))=TRUE,0,VLOOKUP(RIGHT(B5,5),Reference!$A$2:$F$201,4,FALSE))","v":0},0,0,{"$f":"IF(H5<>0,VLOOKUP(RIGHT(B5,5),Reference!$A$2:$H$196,3,FALSE),0)","v":0}]
[null,"39925",null,"Industrial- Personal Property- Non-Metal Mining",0,0,{"$f":"IF(ISERROR(VLOOKUP(B6,Reference!$A$2:$F$201,4,FALSE))=TRUE,0,VLOOKUP(RIGHT(B6,5),Reference!$A$2:$F$201,4,FALSE))","v":0},{"$f":"E6+F6+G6","v":0},{"$f":"IF(H6<>0,VLOOKUP(RIGHT(B6,5),Reference!$A$2:$H$196,3,FALSE),0)","v":0}]
{"$rows_left_out":25}
{"sheet":"Page 10","index":9,"n_rows":35,"n_cols":5,"rows_kept":35,"cut":false,"hidden":false,"merged":[]}
["Pollution Control Exemptions Granted 2024"]
["Abstract Line","Classification","FMV of Exemption Requested","FMV of Exemption Granted","Assessed Value"]
[]
[]
[]
[]
{"$rows_left_out":30}
{"sheet":"Page 11","index":10,"n_rows":35,"n_cols":5,"rows_kept":35,"cut":false,"hidden":false,"merged":[]}
["Fire Control Exemptions Granted 2024"]
["Abstract Line","Classification","FMV of Exemption Requested","FMV of Exemption Granted","Assessed Value"]
[]
[]
[]
[]
{"$rows_left_out":30}
{"sheet":"Page 12","index":11,"n_rows":35,"n_cols":6,"rows_kept":35,"cut":false,"hidden":false,"merged":[]}
["Vacant Land Valuation - Wyo. Stat. Ann. 39-13-103(b)(xvii)"]
["Abstract Line","Classification","FMV not using present worth methodology","Assessed Value","FMV using present worth methodology","Assessed Value"]
[null,"Example: North Hills, 5 lots"]
[]
[]
[]
{"$rows_left_out":30}
{"sheet":"Page 13","index":12,"n_rows":35,"n_cols":6,"rows_kept":35,"cut":false,"hidden":false,"merged":[]}
["Exemption for Economic Development Property- Wyo. Stat. ann. 39-11-105(a)(xxxvii) - Effective January 1, 2011"]
["Abstract Line","Classification","FMV Without Exemption ","Assessed Value","FMV With Exemption","Assessed Value"]
[]
[]
[]
[]
{"$rows_left_out":30}
{"sheet":"Page 14","index":13,"n_rows":15,"n_cols":4,"rows_kept":15,"cut":false,"hidden":false,"merged":[]}
["Properties Held by County Under Tax Purchase"]
["Line","Classification","Fair Market Value","Assessed Value"]
[100,"Irrigated Lands",null,{"$f":"C3*0.095","v":0}]
[200,"Dry Crop Lands ",null,{"$f":"C4*0.095","v":0}]
[300,"Range Lands",null,0]
[301,"Residential Lands",null,0]
{"$rows_left_out":10}
{"sheet":"Page 15","index":14,"n_rows":12,"n_cols":6,"rows_kept":12,"cut":false,"hidden":false,"merged":[[0,0,0,4],[1,0,1,4]]}
["4% Taxable Value Increase Cap Exemptions",null,null,null,null,"1. Run the SBOE Residential Exemption query in Listbuilder"]
[" Wyo. Stat. Ann. 39-13-103(b)(xvii)",null,null,null,null,"2. Export the results into Excel."]
["Abstract Code","Fair Market Value","Total FMV Exemptions","Assessed Value","Total AV Exemptions","3. Highlight only the cells with data, copy, and paste here.                        -->"]
[{"$f":"M4","v":0},{"$f":"G4","v":0},{"$f":"I4","v":0},{"$f":"J4","v":0},{"$f":"L4","v":0}]
[{"$f":"M5","v":0},{"$f":"G5","v":0},{"$f":"I5","v":0},{"$f":"J5","v":0},{"$f":"L5","v":0}]
[0,0,0,0,0]
{"$rows_left_out":7}
{"sheet":"Test","index":15,"n_rows":200,"n_cols":8,"rows_kept":200,"cut":false,"hidden":false,"merged":[]}
["STATEEQUIVABSTCODE","CountOfACCOUNTNO","SumOfRAWASSDVAL","SumOfACTVAL","SumOfACRES","SumOfSQFT","CLASSIFICATIONID","SORTORDER"]
["00101",{"$f":"VALUE(A2)","v":101},{"$f":"B2","v":101},101,101,101,null,{"$f":"LEFT(A2,1)","v":"0"}]
["00102",102,102,102,102,102,null,"0"]
["00103",103,103,103,103,103,null,"0"]
["00400",400,400,400,400,400,null,"0"]
["00200",200,200,200,200,200,null,"0"]
{"$rows_left_out":195}
{"sheet":"Paste","index":16,"n_rows":5,"n_cols":2,"rows_kept":5,"cut":false,"hidden":false,"merged":[]}
[null,"<-- Paste Short Absract Summary Excel Sheet here"]
[null,"Instructions:"]
[null,"1.        In Listbuilder, run the RW Short Abstract Summary with View set to XLS."]
[null,"2.        RW will produce on Excel spreadsheet. Paste the whole sheet onto the sheet in THIS workbook called Paste (this sheet) in the Abstract Form."]
[null,"3.        Double check the first page of the Abstract Form corresponds to the RealWare Short Abstract Summary."]

{"sheet":"Reference","index":17,"n_rows":201,"n_cols":12,"rows_kept":201,"cut":false,"hidden":false,"merged":[[9,7,19,7],[20,7,53,7],[0,7,8,7]]}
[null,"CountOfACCOUNTNO","SumOfRAWASSDVAL","SumOfACTVAL","SumOfACRES","SumOfSQFT",null,"IRRIGATED CROP",40101,"II LRA 1-2-3",4008,{"$f":"K2","v":3279}]
["00101",{"$f":"IF(ISERROR(VLOOKUP($A2,Paste!$B$5:$T$500,4,FALSE))=TRUE,0,VLOOKUP($A2,Paste!$B$5:$T$500,4,FALSE))","v":0},{"$f":"IF(ISERROR(VLOOKUP($A2,Paste!$B$5:$T$500,8,FALSE))=TRUE,0,VLOOKUP($A2,Paste!$B$5:$T$500,8,FALSE))","v":0},{"$f":"IF(ISERROR(VLOOKUP($A2,Paste!$B$5:$T$500,11,FALSE))=TRUE,0,VLOOKUP($A2,Paste!$B$5:$T$500,11,FALSE))","v":0},{"$f":"IF(ISERROR(VLOOKUP($A2,Paste!$B$5:$T$500,16,FALSE))=TRUE,0,VLOOKUP($A2,Paste!$B$5:$T$500,16,FALSE))","v":0},{"$f":"IF(ISERROR(VLOOKUP($A2,Paste!$B$5:$T$500,19,FALSE))=TRUE,0,VLOOKUP($A2,Paste!$B$5:$T$500,19,FALSE))","v":0},null,null,40102,"III LRA 1-2-3",3279,{"$f":"K3","v":2550}]
["00102",{"$f":"IF(ISERROR(VLOOKUP($A3,Paste!$B$5:$T$500,4,FALSE))=TRUE,0,VLOOKUP($A3,Paste!$B$5:$T$500,4,FALSE))","v":0},{"$f":"IF(ISERROR(VLOOKUP($A3,Paste!$B$5:$T$500,8,FALSE))=TRUE,0,VLOOKUP($A3,Paste!$B$5:$T$500,8,FALSE))","v":0},{"$f":"IF(ISERROR(VLOOKUP($A3,Paste!$B$5:$T$500,11,FALSE))=TRUE,0,VLOOKUP($A3,Paste!$B$5:$T$500,11,FALSE))","v":0},{"$f":"IF(ISERROR(VLOOKUP($A3,Paste!$B$5:$T$500,16,FALSE))=TRUE,0,VLOOKUP($A3,Paste!$B$5:$T$500,16,FALSE))","v":0},{"$f":"IF(ISERROR(VLOOKUP($A3,Paste!$B$5:$T$500,19,FALSE))=TRUE,0,VLOOKUP($A3,Paste!$B$5:$T$500,19,FALSE))","v":0},null,null,40103,"IV LRA 1-2-3",2550,{"$f":"K4","v":1822}]
["00103",{"$f":"IF(ISERROR(VLOOKUP($A4,Paste!$B$5:$T$500,4,FALSE))=TRUE,0,VLOOKUP($A4,Paste!$B$5:$T$500,4,FALSE))","v":0},{"$f":"IF(ISERROR(VLOOKUP($A4,Paste!$B$5:$T$500,8,FALSE))=TRUE,0,VLOOKUP($A4,Paste!$B$5:$T$500,8,FALSE))","v":0},{"$f":"IF(ISERROR(VLOOKUP($A4,Paste!$B$5:$T$500,11,FALSE))=TRUE,0,VLOOKUP($A4,Paste!$B$5:$T$500,11,FALSE))","v":0},{"$f":"IF(ISERROR(VLOOKUP($A4,Paste!$B$5:$T$500,16,FALSE))=TRUE,0,VLOOKUP($A4,Paste!$B$5:$T$500,16,FALSE))","v":0},{"$f":"IF(ISERROR(VLOOKUP($A4,Paste!$B$5:$T$500,19,FALSE))=TRUE,0,VLOOKUP($A4,Paste!$B$5:$T$500,19,FALSE))","v":0},null,null,40104,"V-VIII LRA 1-2-3",1822,729]
["00200",{"$f":"IF(ISERROR(VLOOKUP($A5,Paste!$B$5:$T$500,4,FALSE))=TRUE,0,VLOOKUP($A5,Paste!$B$5:$T$500,4,FALSE))","v":0},{"$f":"IF(ISERROR(VLOOKUP($A5,Paste!$B$5:$T$500,8,FALSE))=TRUE,0,VLOOKUP($A5,Paste!$B$5:$T$500,8,FALSE))","v":0},{"$f":"IF(ISERROR(VLOOKUP($A5,Paste!$B$5:$T$500,11,FALSE))=TRUE,0,VLOOKUP($A5,Paste!$B$5:$T$500,11,FALSE))","v":0},{"$f":"IF(ISERROR(VLOOKUP($A5,Paste!$B$5:$T$500,16,FALSE))=TRUE,0,VLOOKUP($A5,Paste!$B$5:$T$500,16,FALSE))","v":0},{"$f":"IF(ISERROR(VLOOKUP($A5,Paste!$B$5:$T$500,19,FALSE))=TRUE,0,VLOOKUP($A5,Paste!$B$5:$T$500,19,FALSE))","v":0}]
["00300",{"$f":"IF(ISERROR(VLOOKUP($A6,Paste!$B$5:$T$500,4,FALSE))=TRUE,0,VLOOKUP($A6,Paste!$B$5:$T$500,4,FALSE))","v":0},{"$f":"IF(ISERROR(VLOOKUP($A6,Paste!$B$5:$T$500,8,FALSE))=TRUE,0,VLOOKUP($A6,Paste!$B$5:$T$500,8,FALSE))","v":0},{"$f":"IF(ISERROR(VLOOKUP($A6,Paste!$B$5:$T$500,11,FALSE))=TRUE,0,VLOOKUP($A6,Paste!$B$5:$T$500,11,FALSE))","v":0},{"$f":"IF(ISERROR(VLOOKUP($A6,Paste!$B$5:$T$500,16,FALSE))=TRUE,0,VLOOKUP($A6,Paste!$B$5:$T$500,16,FALSE))","v":0},{"$f":"IF(ISERROR(VLOOKUP($A6,Paste!$B$5:$T$500,19,FALSE))=TRUE,0,VLOOKUP($A6,Paste!$B$5:$T$500,19,FALSE))","v":0},null,null,40105,"III LRA 4-5",2915,{"$f":"K7","v":2186}]
{"$rows_left_out":196}
{"sheet":"Summary","index":18,"n_rows":88,"n_cols":9,"rows_kept":88,"cut":false,"hidden":false,"merged":[[0,0,0,8]]}
[]
[]
[null,null,2013,2024,"2012",{"$f":"$D$3","v":2024},null,null,{"$f":"$D$3","v":2024}]
[null,null,"Productive","Productive","Assessed","Assessed","Productive Value","Assessed Value","Level of"]
["LINE","CLASSIFICATION","Value","Value","Value","Value","Change","% Change","Assessment"]
["A","AGRICULTRAL LAND",{"$f":"C25","v":88541541},{"$f":"D25","v":0},{"$f":"E25","v":8411446},{"$f":"F25","v":0},{"$f":"D6-C6","v":-88541541},{"$f":"IF(E6=0,\"\",F6/E6-1)","v":-1},{"$f":"IF(D6=0,\"N/A\",F6/D6)","v":"N/A"}]
{"$rows_left_out":82}